{"text_format":"1","workbook":"xlsx","n_sheets":3,"sheets":["Paměť","Formáty","VFMOTO"],"not_rendered":{"charts":1,"images":9,"macros":1,"external_links":0,"defined_names":20,"comments":0,"pivot_tables":0},"unopened":[],"bounds":{"document_bytes":16777216,"sheet_cells":100000,"rows_first":2000,"rows_last":500,"rows_between":2000,"halvings":0,"cell_chars":16384,"cell_head_chars":4096},"cells_cut":0,"cells_raw":0,"read":"whole","date_system":"1900"}

{"sheet":"Paměť","index":0,"n_rows":2,"n_cols":2,"rows_kept":2,"cut":false,"hidden":true,"merged":[]}
[]
[{"$f":"CHOOSE(LJazyk,\"Výstup z přepínačů:\n(Neměniti, nelze zamknout !!)\",\"Output from option buttons:\n(Don't do any changes, cannot be locked !!)\")","v":"Output from option buttons:\n(Don't do any changes, cannot be locked !!)"},2]

{"sheet":"Formáty","index":1,"n_rows":1,"n_cols":1,"rows_kept":1,"cut":false,"hidden":true,"merged":[[1,0,1,11],[6,0,6,8],[8,1,8,11],[8,13,9,14],[8,16,8,18],[9,16,10,18],[10,1,10,11],[10,13,10,14],[13,13,14,13],[13,14,14,14],[14,1,14,2],[14,8,14,10],[15,1,15,2],[15,3,15,4],[15,13,15,14],[12,0,15,0],[12,1,12,11],[13,1,13,2],[13,3,14,4],[13,5,15,5],[13,6,15,6],[13,11,15,11],[17,25,18,26],[17,27,21,27],[18,7,19,7],[19,1,19,2],[19,3,19,4],[20,0,23,0],[20,1,20,2],[20,3,22,4],[20,5,23,5],[20,6,23,6],[16,11,19,11],[16,16,16,23],[17,1,18,2],[17,8,18,8],[17,9,18,9],[17,10,18,10],[17,16,18,24],[16,0,19,0],[16,1,16,2],[16,3,18,4],[16,5,19,5],[16,6,19,6],[16,7,17,7],[21,16,22,16],[21,17,22,17],[21,18,22,19],[21,20,22,21],[22,7,23,7],[23,1,23,2],[23,3,23,4],[23,20,23,21],[20,7,21,7],[20,11,23,11],[21,1,22,2],[21,8,22,8],[21,9,22,9],[21,10,22,10],[25,21,26,21],[26,7,27,7],[27,1,27,2],[27,3,27,4],[28,0,31,0],[28,1,28,2],[28,3,30,4],[28,5,31,5],[28,6,31,6],[28,7,29,7],[24,11,27,11],[25,1,26,2],[25,8,26,8],[25,9,26,9],[25,10,26,10],[25,20,26,20],[24,0,27,0],[24,1,24,2],[24,3,26,4],[24,5,27,5],[24,6,27,6],[24,7,25,7],[29,21,30,21],[30,7,31,7],[31,1,31,2],[31,3,31,4],[32,0,35,0],[32,1,32,2],[32,3,34,4],[32,5,35,5],[32,6,35,6],[32,7,33,7],[28,11,31,11],[29,1,30,2],[29,8,30,8],[29,9,30,9],[29,10,30,10],[29,20,30,20],[33,21,34,21],[34,7,35,7],[35,1,35,2],[35,3,35,4],[36,0,39,0],[36,1,36,2],[36,3,38,4],[36,5,39,5],[36,6,39,6],[36,7,37,7],[32,11,35,11],[33,1,34,2],[33,8,34,8],[33,9,34,9],[33,10,34,10],[33,20,34,20],[36,11,39,11],[37,1,38,2],[37,8,38,8],[37,9,38,9],[37,10,38,10],[37,20,38,23],[38,7,39,7],[39,1,39,2],[39,3,39,4],[41,21,42,21],[42,7,43,7],[43,1,43,2],[43,3,43,4],[44,0,47,0],[44,1,44,2],[44,3,46,4],[44,5,47,5],[44,6,47,6],[44,7,45,7],[40,11,43,11],[41,1,42,2],[41,8,42,8],[41,9,42,9],[41,10,42,10],[41,20,42,20],[40,0,43,0],[40,1,40,2],[40,3,42,4],[40,5,43,5],[40,6,43,6],[40,7,41,7],[44,11,47,11],[44,20,45,23],[45,1,46,2],[45,8,46,8],[45,9,46,9],[45,10,46,10],[46,7,47,7],[46,20,47,23],[47,1,47,2],[47,3,47,4],[52,0,55,0],[52,1,52,2],[52,3,54,4],[52,5,55,5],[52,6,55,6],[52,7,53,7],[48,11,51,11],[49,1,50,2],[49,8,50,8],[49,9,50,9],[49,10,50,10],[50,7,51,7],[51,1,51,2],[51,3,51,4],[48,0,51,0],[48,1,48,2],[48,3,50,4],[48,5,51,5],[48,6,51,6],[48,7,49,7],[52,11,55,11],[53,1,54,2],[53,8,54,8],[53,9,54,9],[53,10,54,10],[53,20,54,24],[54,7,55,7],[55,1,55,2],[55,3,55,4],[56,11,59,11],[57,1,58,2],[57,8,58,8],[57,9,58,9],[57,10,58,10],[58,7,59,7],[59,1,59,2],[59,3,59,4],[56,0,59,0],[56,1,56,2],[56,3,58,4],[56,5,59,5],[56,6,59,6],[56,7,57,7],[61,17,62,17],[61,18,62,24],[62,7,63,7],[63,1,63,2],[63,3,63,4],[61,16,62,16],[64,0,67,0],[64,1,64,2],[64,3,66,4],[64,5,67,5],[64,6,67,6],[60,11,63,11],[61,1,62,2],[61,8,62,8],[61,9,62,9],[61,10,62,10],[60,0,63,0],[60,1,60,2],[60,3,62,4],[60,5,63,5],[60,6,63,6],[60,7,61,7],[64,7,65,7],[64,11,67,11],[65,1,66,2],[65,8,66,8],[65,9,66,9],[65,10,66,10],[66,7,67,7],[67,1,67,2],[67,3,67,4],[68,11,71,11],[69,1,70,2],[69,8,70,8],[69,9,70,9],[69,10,70,10],[70,7,71,7],[71,1,71,2],[71,3,71,4],[68,0,71,0],[68,1,68,2],[68,3,70,4],[68,5,71,5],[68,6,71,6],[68,7,69,7],[72,11,75,11],[73,1,74,2],[73,8,74,8],[73,9,74,9],[73,10,74,10],[74,7,75,7],[75,1,75,2],[75,3,75,4],[72,0,75,0],[72,1,72,2],[72,3,74,4],[72,5,75,5],[72,6,75,6],[72,7,73,7],[108,2,108,6],[108,8,108,11],[109,2,109,6],[109,8,109,11],[110,2,110,6],[110,8,110,11],[76,1,76,11],[99,1,101,11],[103,4,103,6],[105,1,105,11],[106,2,106,11],[107,1,107,6],[107,7,107,11],[114,2,114,6],[114,8,114,11],[119,1,120,4],[122,1,123,4],[132,3,132,4],[133,1,133,4],[111,2,111,6],[111,8,111,11],[112,2,112,6],[112,8,112,11],[113,2,113,6],[113,8,113,11],[139,1,140,2],[139,3,139,5],[139,6,139,8],[139,9,139,11],[140,3,140,5],[140,6,140,8],[140,9,140,11],[134,1,134,4],[135,1,136,4],[137,1,138,5],[137,6,137,7],[137,8,137,9],[137,10,137,11],[138,6,138,7],[138,8,138,9],[138,10,138,11],[152,1,153,5],[152,6,152,7],[152,8,152,9],[152,10,152,11],[153,6,153,7],[153,8,153,9],[153,10,153,11],[141,6,141,7],[141,9,141,10],[147,3,147,4],[148,1,148,4],[149,1,149,4],[150,1,151,4],[156,6,156,7],[156,9,156,10],[162,3,162,4],[163,1,163,4],[164,1,164,4],[165,1,166,4],[154,1,155,2],[154,3,154,5],[154,6,154,8],[154,9,154,11],[155,3,155,5],[155,6,155,8],[155,9,155,11],[169,1,170,2],[169,3,169,5],[169,6,169,8],[169,9,169,11],[170,3,170,5],[170,6,170,8],[170,9,170,11],[167,1,168,5],[167,6,167,7],[167,8,167,9],[167,10,167,11],[168,6,168,7],[168,8,168,9],[168,10,168,11],[182,1,183,5],[182,6,182,7],[182,8,182,9],[182,10,182,11],[183,6,183,7],[183,8,183,9],[183,10,183,11],[171,6,171,7],[171,9,171,10],[177,3,177,4],[178,1,178,4],[179,1,179,4],[180,1,181,4],[186,6,186,7],[186,9,186,10],[192,3,192,4],[193,1,193,4],[194,1,194,4],[195,1,196,4],[184,1,185,2],[184,3,184,5],[184,6,184,8],[184,9,184,11],[185,3,185,5],[185,6,185,8],[185,9,185,11],[199,1,200,2],[199,3,199,5],[199,6,199,8],[199,9,199,11],[200,3,200,5],[200,6,200,8],[200,9,200,11],[197,1,198,5],[197,6,197,7],[197,8,197,9],[197,10,197,11],[198,6,198,7],[198,8,198,9],[198,10,198,11],[212,1,213,5],[212,6,212,7],[212,8,212,9],[212,10,212,11],[213,6,213,7],[213,8,213,9],[213,10,213,11],[201,6,201,7],[201,9,201,10],[207,3,207,4],[208,1,208,4],[209,1,209,4],[210,1,211,4],[216,6,216,7],[216,9,216,10],[222,3,222,4],[223,1,223,4],[224,1,224,4],[225,1,226,4],[214,1,215,2],[214,3,214,5],[214,6,214,8],[214,9,214,11],[215,3,215,5],[215,6,215,8],[215,9,215,11],[229,1,230,2],[229,3,229,5],[229,6,229,8],[229,9,229,11],[230,3,230,5],[230,6,230,8],[230,9,230,11],[227,1,228,5],[227,6,227,7],[227,8,227,9],[227,10,227,11],[228,6,228,7],[228,8,228,9],[228,10,228,11],[242,1,243,5],[242,6,242,7],[242,8,242,9],[242,10,242,11],[243,6,243,7],[243,8,243,9],[243,10,243,11],[231,6,231,7],[231,9,231,10],[237,3,237,4],[238,1,238,4],[239,1,239,4],[240,1,241,4],[246,6,246,7],[246,9,246,10],[252,3,252,4],[253,1,253,4],[254,1,254,4],[255,1,256,4],[244,1,245,2],[244,3,244,5],[244,6,244,8],[244,9,244,11],[245,3,245,5],[245,6,245,8],[245,9,245,11],[259,1,260,2],[259,3,259,5],[259,6,259,8],[259,9,259,11],[260,3,260,5],[260,6,260,8],[260,9,260,11],[257,1,258,5],[257,6,257,7],[257,8,257,9],[257,10,257,11],[258,6,258,7],[258,8,258,9],[258,10,258,11],[272,1,273,5],[272,6,272,7],[272,8,272,9],[272,10,272,11],[273,6,273,7],[273,8,273,9],[273,10,273,11],[261,6,261,7],[261,9,261,10],[267,3,267,4],[268,1,268,4],[269,1,269,4],[270,1,271,4],[276,6,276,7],[276,9,276,10],[282,3,282,4],[283,1,283,4],[284,1,284,4],[285,1,286,4],[274,1,275,2],[274,3,274,5],[274,6,274,8],[274,9,274,11],[275,3,275,5],[275,6,275,8],[275,9,275,11],[289,1,290,2],[289,3,289,5],[289,6,289,8],[289,9,289,11],[290,3,290,5],[290,6,290,8],[290,9,290,11],[287,1,288,5],[287,6,287,7],[287,8,287,9],[287,10,287,11],[288,6,288,7],[288,8,288,9],[288,10,288,11],[302,1,303,5],[302,6,302,7],[302,8,302,9],[302,10,302,11],[303,6,303,7],[303,8,303,9],[303,10,303,11],[291,6,291,7],[291,9,291,10],[297,3,297,4],[298,1,298,4],[299,1,299,4],[300,1,301,4],[306,6,306,7],[306,9,306,10],[312,3,312,4],[313,1,313,4],[314,1,314,4],[315,1,316,4],[304,1,305,2],[304,3,304,5],[304,6,304,8],[304,9,304,11],[305,3,305,5],[305,6,305,8],[305,9,305,11],[319,1,320,2],[319,3,319,5],[319,6,319,8],[319,9,319,11],[320,3,320,5],[320,6,320,8],[320,9,320,11],[317,1,318,5],[317,6,317,7],[317,8,317,9],[317,10,317,11],[318,6,318,7],[318,8,318,9],[318,10,318,11],[332,1,333,5],[332,6,332,7],[332,8,332,9],[332,10,332,11],[333,6,333,7],[333,8,333,9],[333,10,333,11],[321,6,321,7],[321,9,321,10],[327,3,327,4],[328,1,328,4],[329,1,329,4],[330,1,331,4],[336,6,336,7],[336,9,336,10],[342,3,342,4],[343,1,343,4],[344,1,344,4],[345,1,346,4],[334,1,335,2],[334,3,334,5],[334,6,334,8],[334,9,334,11],[335,3,335,5],[335,6,335,8],[335,9,335,11],[349,1,350,2],[349,3,349,5],[349,6,349,8],[349,9,349,11],[350,3,350,5],[350,6,350,8],[350,9,350,11],[347,1,348,5],[347,6,347,7],[347,8,347,9],[347,10,347,11],[348,6,348,7],[348,8,348,9],[348,10,348,11],[386,1,386,4],[388,5,388,11],[412,7,412,9],[413,1,413,4],[415,5,415,11],[439,7,439,9],[351,6,351,7],[351,9,351,10],[358,7,358,9],[359,1,359,4],[361,5,361,11],[385,7,385,9],[494,1,494,4],[496,5,496,11],[520,7,520,9],[521,1,521,4],[523,5,523,11],[547,7,547,9],[440,1,440,4],[442,5,442,11],[466,7,466,9],[467,1,467,4],[469,5,469,11],[493,7,493,9],[602,1,602,4],[604,5,604,11],[628,7,628,9],[629,1,629,4],[631,5,631,11],[655,7,655,9],[548,1,548,4],[550,5,550,11],[574,7,574,9],[575,1,575,4],[577,5,577,11],[601,7,601,9],[710,1,710,4],[712,5,712,11],[736,7,736,9],[737,1,737,4],[739,5,739,11],[656,1,656,4],[658,5,658,11],[682,7,682,9],[683,1,683,4],[685,5,685,11],[709,7,709,9]]}
["Toto listí je jen úschovna formátů, ocaď ce formáty kopírují do ostatních listí při vkládání dat tam, aby se nevypucovávaly, je tedy potřeba sem dát všechyn změny formátování!!!!!!!!!!!!! - Staf 24.2.2023"]

{"sheet":"VFMOTO","index":2,"n_rows":741,"n_cols":29,"rows_kept":741,"cut":false,"hidden":false,"merged":[[155,6,155,8],[170,6,170,8],[185,6,185,8],[319,9,319,11],[231,9,231,10],[171,9,171,10],[171,6,171,7],[186,9,186,10],[186,6,186,7],[182,10,182,11],[228,8,228,9],[228,10,228,11],[306,9,306,10],[318,8,318,9],[246,9,246,10],[242,8,242,9],[275,9,275,11],[246,6,246,7],[229,6,229,8],[231,6,231,7],[305,9,305,11],[290,6,290,8],[305,6,305,8],[215,6,215,8],[230,6,230,8],[303,6,303,7],[317,6,317,7],[317,8,317,9],[155,9,155,11],[43,1,43,2],[41,1,42,2],[43,3,43,4],[45,8,46,8],[45,9,46,9],[45,10,46,10],[44,7,45,7],[46,7,47,7],[44,3,46,4],[44,5,47,5],[44,6,47,6],[57,10,58,10],[56,7,57,7],[58,7,59,7],[56,3,58,4],[59,3,59,4],[56,6,59,6],[152,10,152,11],[48,11,51,11],[35,1,35,2],[39,1,39,2],[24,1,24,2],[25,1,26,2],[28,1,28,2],[29,1,30,2],[32,1,32,2],[33,1,34,2],[36,1,36,2],[37,1,38,2],[40,1,40,2],[31,1,31,2],[17,8,18,8],[17,9,18,9],[17,10,18,10],[16,3,18,4],[18,7,19,7],[16,7,17,7],[21,8,22,8],[21,9,22,9],[21,10,22,10],[20,7,21,7],[22,7,23,7],[20,3,22,4],[16,5,19,5],[16,6,19,6],[40,3,42,4],[40,5,43,5],[40,6,43,6],[41,8,42,8],[40,7,41,7],[42,7,43,7],[41,9,42,9],[41,10,42,10],[61,16,62,16],[61,17,62,17],[69,8,70,8],[69,9,70,9],[69,10,70,10],[68,7,69,7],[70,7,71,7],[68,3,70,4],[68,11,71,11],[61,8,62,8],[61,9,62,9],[61,10,62,10],[60,7,61,7],[62,7,63,7],[60,3,62,4],[65,8,66,8],[65,9,66,9],[65,10,66,10],[64,7,65,7],[66,7,67,7],[64,3,66,4],[68,6,71,6],[60,11,63,11],[64,11,67,11],[37,8,38,8],[37,9,38,9],[37,10,38,10],[36,7,37,7],[38,7,39,7],[36,3,38,4],[39,3,39,4],[29,8,30,8],[29,9,30,9],[29,10,30,10],[28,7,29,7],[30,7,31,7],[28,5,31,5],[28,6,31,6],[31,3,31,4],[36,5,39,5],[36,6,39,6],[35,3,35,4],[52,11,55,11],[56,11,59,11],[49,9,50,9],[49,10,50,10],[48,7,49,7],[50,7,51,7],[53,8,54,8],[53,9,54,9],[53,10,54,10],[52,7,53,7],[54,7,55,7],[49,8,50,8],[57,8,58,8],[52,0,55,0],[56,0,59,0],[60,0,63,0],[64,0,67,0],[60,1,60,2],[57,1,58,2],[63,1,63,2],[49,1,50,2],[64,1,64,2],[65,1,66,2],[51,1,51,2],[68,0,71,0],[72,0,75,0],[56,5,59,5],[48,5,51,5],[52,5,55,5],[55,1,55,2],[45,1,46,2],[48,1,48,2],[61,1,62,2],[59,1,59,2],[52,1,52,2],[53,1,54,2],[56,1,56,2],[72,3,74,4],[68,5,71,5],[63,3,63,4],[55,3,55,4],[71,3,71,4],[47,1,47,2],[68,1,68,2],[69,1,70,2],[72,1,72,2],[44,0,47,0],[48,0,51,0],[113,8,113,11],[108,8,108,11],[137,6,137,7],[135,1,136,4],[133,1,133,4],[132,3,132,4],[182,1,183,5],[315,1,316,4],[334,3,334,5],[334,6,334,8],[334,9,334,11],[334,1,335,2],[335,9,335,11],[333,10,333,11],[333,8,333,9],[332,10,332,11],[332,8,332,9],[332,6,332,7],[333,6,333,7],[321,9,321,10],[321,6,321,7],[319,6,319,8],[318,6,318,7],[320,6,320,8],[114,8,114,11],[114,2,114,6],[119,1,120,4],[122,1,123,4],[72,5,75,5],[72,6,75,6],[64,5,67,5],[67,1,67,2],[67,3,67,4],[106,2,106,11],[72,11,75,11],[73,8,74,8],[73,9,74,9],[73,10,74,10],[72,7,73,7],[112,2,112,6],[113,2,113,6],[108,2,108,6],[109,2,109,6],[107,7,107,11],[75,3,75,4],[99,1,101,11],[112,8,112,11],[75,1,75,2],[60,5,63,5],[111,2,111,6],[107,1,107,6],[109,8,109,11],[105,1,105,11],[103,4,103,6],[76,1,76,11],[73,1,74,2],[44,1,44,2],[60,6,63,6],[48,3,50,4],[52,3,54,4],[64,6,67,6],[110,2,110,6],[74,7,75,7],[44,11,47,11],[71,1,71,2],[110,8,110,11],[111,8,111,11],[48,6,51,6],[51,3,51,4],[47,3,47,4],[52,6,55,6],[57,9,58,9],[156,9,156,10],[156,6,156,7],[155,3,155,5],[162,3,162,4],[154,1,155,2],[154,3,154,5],[134,1,134,4],[138,10,138,11],[138,8,138,9],[138,6,138,7],[147,3,147,4],[148,1,148,4],[140,9,140,11],[149,1,149,4],[139,1,140,2],[137,8,137,9],[153,6,153,7],[153,8,153,9],[153,10,153,11],[141,6,141,7],[141,9,141,10],[137,10,137,11],[139,9,139,11],[140,6,140,8],[170,3,170,5],[170,9,170,11],[163,1,163,4],[164,1,164,4],[165,1,166,4],[167,6,167,7],[167,1,168,5],[168,10,168,11],[169,3,169,5],[169,1,170,2],[167,8,167,9],[168,6,168,7],[168,8,168,9],[169,9,169,11],[167,10,167,11],[739,5,739,11],[342,3,342,4],[343,1,343,4],[344,1,344,4],[345,1,346,4],[347,6,347,7],[347,8,347,9],[347,10,347,11],[348,6,348,7],[348,8,348,9],[348,10,348,11],[712,5,712,11],[685,5,685,11],[658,5,658,11],[550,5,550,11],[523,5,523,11],[388,5,388,11],[737,1,737,4],[710,1,710,4],[656,1,656,4],[521,1,521,4],[575,1,575,4],[602,1,602,4],[385,7,385,9],[208,1,208,4],[209,1,209,4],[210,1,211,4],[213,8,213,9],[214,6,214,8],[227,1,228,5],[214,1,215,2],[224,1,224,4],[225,1,226,4],[227,6,227,7],[227,8,227,9],[215,3,215,5],[215,9,215,11],[222,3,222,4],[223,1,223,4],[212,8,212,9],[212,10,212,11],[213,6,213,7],[214,3,214,5],[227,10,227,11],[212,6,212,7],[212,1,213,5],[216,9,216,10],[216,6,216,7],[683,1,683,4],[359,1,359,4],[386,1,386,4],[631,5,631,11],[287,8,287,9],[287,10,287,11],[288,10,288,11],[288,6,288,7],[288,8,288,9],[287,6,287,7],[320,9,320,11],[291,9,291,10],[289,6,289,8],[289,9,289,11],[306,6,306,7],[304,6,304,8],[304,9,304,11],[317,10,317,11],[318,10,318,11],[629,1,629,4],[332,1,333,5],[413,1,413,4],[548,1,548,4],[440,1,440,4],[195,1,196,4],[197,6,197,7],[197,1,198,5],[197,8,197,9],[197,10,197,11],[198,6,198,7],[198,8,198,9],[198,10,198,11],[207,3,207,4],[199,1,200,2],[199,9,199,11],[200,3,200,5],[200,9,200,11],[201,9,201,10],[201,6,201,7],[199,3,199,5],[199,6,199,8],[200,6,200,8],[229,3,229,5],[230,3,230,5],[229,1,230,2],[244,6,244,8],[243,10,243,11],[245,3,245,5],[298,1,298,4],[302,1,303,5],[261,9,261,10],[290,9,290,11],[274,1,275,2],[230,9,230,11],[257,8,257,9],[257,10,257,11],[258,8,258,9],[258,10,258,11],[259,9,259,11],[303,10,303,11],[274,6,274,8],[274,9,274,11],[282,3,282,4],[283,1,283,4],[255,1,256,4],[303,8,303,9],[237,3,237,4],[238,1,238,4],[239,1,239,4],[240,1,241,4],[244,9,244,11],[245,9,245,11],[245,6,245,8],[252,3,252,4],[242,1,243,5],[244,1,245,2],[242,6,242,7],[242,10,242,11],[275,3,275,5],[253,1,253,4],[259,1,260,2],[267,3,267,4],[268,1,268,4],[273,10,273,11],[269,1,269,4],[270,1,271,4],[272,1,273,5],[260,9,260,11],[272,6,272,7],[260,6,260,8],[275,6,275,8],[257,1,258,5],[273,8,273,9],[284,1,284,4],[290,3,290,5],[289,1,290,2],[289,3,289,5],[287,1,288,5],[327,3,327,4],[312,3,312,4],[313,1,313,4],[319,1,320,2],[320,3,320,5],[319,3,319,5],[317,1,318,5],[299,1,299,4],[300,1,301,4],[297,3,297,4],[304,1,305,2],[304,3,304,5],[305,3,305,5],[314,1,314,4],[467,1,467,4],[494,1,494,4],[330,1,331,4],[329,1,329,4],[328,1,328,4],[361,5,361,11],[415,5,415,11],[442,5,442,11],[336,9,336,10],[336,6,336,7],[351,9,351,10],[351,6,351,7],[347,1,348,5],[412,8,412,9],[358,7,358,9],[335,3,335,5],[349,1,350,2],[349,3,349,5],[349,6,349,8],[349,9,349,11],[350,3,350,5],[350,9,350,11],[335,6,335,8],[350,6,350,8],[192,3,192,4],[193,1,193,4],[194,1,194,4],[137,1,138,5],[152,1,153,5],[140,3,140,5],[139,6,139,8],[139,3,139,5],[178,1,178,4],[169,6,169,8],[177,3,177,4],[150,1,151,4],[152,6,152,7],[152,8,152,9],[154,6,154,8],[154,9,154,11],[184,1,185,2],[184,3,184,5],[184,6,184,8],[182,8,182,9],[184,9,184,11],[185,3,185,5],[183,6,183,7],[183,8,183,9],[179,1,179,4],[285,1,286,4],[180,1,181,4],[182,6,182,7],[26,7,27,7],[24,3,26,4],[302,6,302,7],[302,8,302,9],[302,10,302,11],[257,6,257,7],[258,6,258,7],[259,6,259,8],[243,6,243,7],[243,8,243,9],[261,6,261,7],[276,9,276,10],[244,3,244,5],[254,1,254,4],[291,6,291,7],[272,8,272,9],[272,10,272,11],[273,6,273,7],[274,3,274,5],[276,6,276,7],[36,0,39,0],[40,0,43,0],[28,11,31,11],[32,11,35,11],[36,11,39,11],[13,5,15,5],[20,5,23,5],[20,6,23,6],[23,1,23,2],[23,3,23,4],[24,5,27,5],[27,1,27,2],[27,3,27,4],[19,3,19,4],[13,11,15,11],[16,11,19,11],[20,11,23,11],[24,11,27,11],[19,1,19,2],[15,1,15,2],[14,8,14,10],[24,7,25,7],[40,11,43,11],[24,6,27,6],[1,0,1,11],[25,8,26,8],[25,9,26,9],[25,10,26,10],[17,27,21,27],[6,0,6,8],[12,1,12,11],[10,1,10,11],[13,6,15,6],[10,13,10,14],[8,13,9,14],[9,16,10,18],[13,13,14,13],[13,14,14,14],[21,16,22,16],[21,17,22,17],[21,18,22,19],[21,20,22,21],[16,16,16,23],[8,16,8,18],[15,13,15,14],[17,16,18,24],[8,1,8,11],[16,1,16,2],[12,0,15,0],[16,0,19,0],[20,0,23,0],[24,0,27,0],[28,0,31,0],[32,0,35,0],[17,25,18,26],[32,6,35,6],[23,20,23,21],[28,3,30,4],[33,8,34,8],[33,9,34,9],[33,10,34,10],[32,7,33,7],[34,7,35,7],[32,3,34,4],[32,5,35,5],[17,1,18,2],[13,1,13,2],[14,1,14,2],[13,3,14,4],[15,3,15,4],[20,1,20,2],[21,1,22,2],[44,20,45,23],[46,20,47,23],[53,20,54,24],[61,18,62,24],[25,20,26,20],[25,21,26,21],[29,20,30,20],[29,21,30,21],[37,20,38,23],[33,20,34,20],[33,21,34,21],[41,20,42,20],[41,21,42,21],[228,6,228,7],[185,9,185,11],[213,10,213,11],[229,9,229,11],[214,9,214,11],[183,10,183,11],[682,8,682,9],[709,8,709,9],[736,8,736,9],[439,8,439,9],[466,8,466,9],[493,8,493,9],[520,8,520,9],[547,8,547,9],[574,8,574,9],[601,8,601,9],[628,8,628,9],[655,8,655,9],[469,5,469,11],[604,5,604,11],[496,5,496,11],[577,5,577,11],[259,3,259,5],[260,3,260,5]]}
[]
[{"$f":"CHOOSE(LJazyk,\"Volba hodnot měřiče a typu závěrky, pro daná čidla měnit jen typ závěrky, vzdálenosti jsou dány:\",\"Selection of meter values and shutter type, for given sensor changing only shutter type, distances are fixed:\")","v":"Selection of meter values and shutter type, for given sensor changing only shutter type, distances are fixed:"}]
[null,null,null,null,null,null,null,null,{"$f":"CHOOSE(LJazyk,\"Vzdálenost středů krajních čidel snímače pro měření formátu 6x6 cm: \",\"Distance of centres of sensor edge probes for 6x6 cm format measurements: \")","v":"Distance of centres of sensor edge probes for 6x6 cm format measurements: "},49.6,"mm"]
[null,null,null,null,null,null,null,null,{"$f":"CHOOSE(LJazyk,\"Vzdálenost středů kraj. čidel pro měření horizontálního běhu - kinofilm (36 mm): \",\"Distance of centres of edge probes for horizontal running - kinofilm (36 mm): \")","v":"Distance of centres of edge probes for horizontal running - kinofilm (36 mm): "},29.4,"mm"]
[null,null,null,null,null,null,null,null,{"$f":"CHOOSE(LJazyk,\"Vzdálenost středů krajních čidel pro měření vertikálního běhu - kinofilm (24 mm): \",\"Distance of centres of edge probes for vertical running - kinofilm (24 mm): \")","v":"Distance of centres of edge probes for vertical running - kinofilm (24 mm): "},18.3,"mm"]
[null,null,null,null,null,null,null,null,"Použitá vzdálenost krajních dijod čidla: ",{"$f":"IF(LEFT(TRIM(UPPER(J7)),1)=\"V\",J5,IF(LEFT(TRIM(UPPER(J7)),1)=\"6\",J3,J4))","v":29.4},"mm"]
[{"$f":"CHOOSE(LJazyk,\"Formát 6x6 (6), kinofilm s během vertikálním (V) nebo horizontálním (jiné): \",\"Format 6x6 (6), kinofilm with vertical (V) or horizontal (other) running: \")","v":"Format 6x6 (6), kinofilm with vertical (V) or horizontal (other) running: "},null,null,null,null,null,null,null,null,"H"]
[]
[null,null,null,null,null,null,null,null,null,null,null,null,null,"Povolená tolerance\nrozdílu rychlosti pláten:",null,null,{"$f":"CHOOSE(LJazyk,\"Počet platných číslic pro zobrazení\nČasu, Šířky štěrbiny a Rychlosti (pláten/štěrbiny)\",  \"Number of valid digits to display\nTime, Slit width and Velocity (curtains/slits)\")","v":"Number of valid digits to display\nTime, Slit width and Velocity (curtains/slits)"}]
[null,null,null,null,null,null,null,null,null,null,null,null,null,null,null,null,3]
[null,{"$f":"CHOOSE(LJazyk,CONCATENATE(\"Štěrbinová závěrka \",IF(LEFT(TRIM(UPPER(J7)),1)=\"6\",CONCATENATE(\"je formátu 6x6 cm, měřící vzdálenost \",ZaokrText(J3,3),\" mm\"),IF(LEFT(TRIM(UPPER(J7)),1)=\"V\",CONCATENATE(\"má vertikální běh, měřící vzdálenost \",ZaokrText(J5,3),\" mm\"),CONCATENATE(\"má horizontální běh, měřící vzdálenost \",ZaokrText(J4,3),\" mm\"))),IF(LEFT(TRIM(UPPER(J7)),1)<>\"6\",\", měřič VFMOTO a originální snímač.\",\", měřič VFMOTO a snímač 6x6.\")),\n    CONCATENATE(\"Focal-plane shutter \",IF(LEFT(TRIM(UPPER(J7)),1)=\"6\",CONCATENATE(\"has format 6x6 cm, meas. distance \",ZaokrText(J3,3),\" mm\"),IF(LEFT(TRIM(UPPER(J7)),1)=\"V\",CONCATENATE(\"with vertical run, meas. distance \",ZaokrText(J5,3),\" mm\"),CONCATENATE(\"with horizontal run, meas. distance \",ZaokrText(J4,3),\" mm\"))),IF(LEFT(TRIM(UPPER(J7)),1)<>\"6\",\", VFMOTO device and original sensor.\",\", VFMOTO device and sensor 6x6.\")))","v":"Focal-plane shutter with horizontal run, meas. distance 29,4 mm, VFMOTO device and original sensor."},null,null,null,null,null,null,null,null,null,null,null,1.5]
[]
[{"$f":"CHOOSE(LJazyk,\"číslo řádku\",  \"row number\")","v":"row number"},{"$f":"CHOOSE(LJazyk,\"Výsledky měření štěrbinové závěrky; odchylky, rozptyl a nepravidelnost dle DIN 19016-06.83\",  \"Shutter measurement results; deviations, variance and irregularity acc. to DIN 19016-06.83\")","v":"Shutter measurement results; deviations, variance and irregularity acc. to DIN 19016-06.83"}]
[null,{"$f":"CHOOSE(LJazyk,\"Nastavený čas\",\"Selected time\")","v":"Selected time"},null,{"$f":"CHOOSE(LJazyk,\"Průměrný\nzměřený čas\",  \"Average\nmeasured time\")","v":"Average\nmeasured time"},null,{"$f":"CHOOSE(LJazyk,\"Odchylka prům.\nzm. času\",  \"Deviation of meas. time\")","v":"Deviation of meas. time"},{"$f":"CHOOSE(LJazyk,\"Rozptyl\nměřených\nhodnot\",  \"Variance of meas. values\")","v":"Variance of meas. values"},{"$f":"CHOOSE(LJazyk,\" Rychlost\",\"Velocity \")","v":"Velocity "},null,null,null,{"$f":"CHOOSE(LJazyk,\"Nepravi- delnost\nr [-]\",  \"Irregu- larity\nr [-]\")","v":"Irregu- larity\nr [-]"},null,"Stř. čas a krajní časy","počet platných číslic pro ně"]
[null,{"$f":"CHOOSE(LJazyk,\"Nastavený čas dle DIN\",  \"Selected time DIN\")","v":"Selected time DIN"},null,null,null,null,null,{"$f":"CHOOSE(LJazyk,\"1. plátna\",  \"1. curtain\")","v":"1. curtain"},{"$f":"CHOOSE(LJazyk,\"v pozici běhu pláten/štěrbiny:\",  \"in point of run of curtains/slit:\")","v":"in point of run of curtains/slit:"},null,null,null,null,null,null,null,{"$f":"CHOOSE(LJazyk,\"Následující je pro gřaf a je tu proto, že\",  \"Following is for chart and is here because\")","v":"Following is for chart and is here because"}]
{"$rows_left_out":726}