{"text_format":"1","workbook":"xlsx","n_sheets":3,"sheets":["Paměť","Formáty","VFMOTO"],"not_rendered":{"charts":1,"images":9,"macros":1,"external_links":0,"defined_names":20,"comments":0,"pivot_tables":0},"unopened":[],"bounds":{"document_bytes":16777216,"sheet_cells":100000,"rows_first":2000,"rows_last":500,"rows_between":2000,"halvings":0,"cell_chars":16384,"cell_head_chars":4096},"cells_cut":0,"cells_raw":0,"read":"whole","date_system":"1900"}

{"sheet":"Paměť","index":0,"n_rows":2,"n_cols":2,"rows_kept":2,"cut":false,"hidden":true,"merged":[]}
[]
[{"$f":"CHOOSE(LJazyk,\"Výstup z přepínačů:\n(Neměniti, nelze zamknout !!)\",\"Output from option buttons:\n(Don't do any changes, cannot be locked !!)\")","v":"Output from option buttons:\n(Don't do any changes, cannot be locked !!)"},2]

{"sheet":"Formáty","index":1,"n_rows":1,"n_cols":1,"rows_kept":1,"cut":false,"hidden":true,"merged":[[1,0,1,11],[6,0,6,8],[8,1,8,11],[8,13,9,14],[8,16,8,18],[9,16,10,18],[10,1,10,11],[10,13,10,14],[13,13,14,13],[13,14,14,14],[14,1,14,2],[14,8,14,10],[15,1,15,2],[15,3,15,4],[15,13,15,14],[12,0,15,0],[12,1,12,11],[13,1,13,2],[13,3,14,4],[13,5,15,5],[13,6,15,6],[13,11,15,11],[17,25,18,26],[17,27,21,27],[18,7,19,7],[19,1,19,2],[19,3,19,4],[20,0,23,0],[20,1,20,2],[20,3,22,4],[20,5,23,5],[20,6,23,6],[16,11,19,11],[16,16,16,23],[17,1,18,2],[17,8,18,8],[17,9,18,9],[17,10,18,10],[17,16,18,24],[16,0,19,0],[16,1,16,2],[16,3,18,4],[16,5,19,5],[16,6,19,6],[16,7,17,7],[21,16,22,16],[21,17,22,17],[21,18,22,19],[21,20,22,21],[22,7,23,7],[23,1,23,2],[23,3,23,4],[23,20,23,21],[20,7,21,7],[20,11,23,11],[21,1,22,2],[21,8,22,8],[21,9,22,9],[21,10,22,10],[25,21,26,21],[26,7,27,7],[27,1,27,2],[27,3,27,4],[28,0,31,0],[28,1,28,2],[28,3,30,4],[28,5,31,5],[28,6,31,6],[28,7,29,7],[24,11,27,11],[25,1,26,2],[25,8,26,8],[25,9,26,9],[25,10,26,10],[25,20,26,20],[24,0,27,0],[24,1,24,2],[24,3,26,4],[24,5,27,5],[24,6,27,6],[24,7,25,7],[29,21,30,21],[30,7,31,7],[31,1,31,2],[31,3,31,4],[32,0,35,0],[32,1,32,2],[32,3,34,4],[32,5,35,5],[32,6,35,6],[32,7,33,7],[28,11,31,11],[29,1,30,2],[29,8,30,8],[29,9,30,9],[29,10,30,10],[29,20,30,20],[33,21,34,21],[34,7,35,7],[35,1,35,2],[35,3,35,4],[36,0,39,0],[36,1,36,2],[36,3,38,4],[36,5,39,5],[36,6,39,6],[36,7,37,7],[32,11,35,11],[33,1,34,2],[33,8,34,8],[33,9,34,9],[33,10,34,10],[33,20,34,20],[36,11,39,11],[37,1,38,2],[37,8,38,8],[37,9,38,9],[37,10,38,10],[37,20,38,23],[38,7,39,7],[39,1,39,2],[39,3,39,4],[41,21,42,21],[42,7,43,7],[43,1,43,2],[43,3,43,4],[44,0,47,0],[44,1,44,2],[44,3,46,4],[44,5,47,5],[44,6,47,6],[44,7,45,7],[40,11,43,11],[41,1,42,2],[41,8,42,8],[41,9,42,9],[41,10,42,10],[41,20,42,20],[40,0,43,0],[40,1,40,2],[40,3,42,4],[40,5,43,5],[40,6,43,6],[40,7,41,7],[44,11,47,11],[44,20,45,23],[45,1,46,2],[45,8,46,8],[45,9,46,9],[45,10,46,10],[46,7,47,7],[46,20,47,23],[47,1,47,2],[47,3,47,4],[52,0,55,0],[52,1,52,2],[52,3,54,4],[52,5,55,5],[52,6,55,6],[52,7,53,7],[48,11,51,11],[49,1,50,2],[49,8,50,8],[49,9,50,9],[49,10,50,10],[50,7,51,7],[51,1,51,2],[51,3,51,4],[48,0,51,0],[48,1,48,2],[48,3,50,4],[48,5,51,5],[48,6,51,6],[48,7,49,7],[52,11,55,11],[53,1,54,2],[53,8,54,8],[53,9,54,9],[53,10,54,10],[53,20,54,24],[54,7,55,7],[55,1,55,2],[55,3,55,4],[56,11,59,11],[57,1,58,2],[57,8,58,8],[57,9,58,9],[57,10,58,10],[58,7,59,7],[59,1,59,2],[59,3,59,4],[56,0,59,0],[56,1,56,2],[56,3,58,4],[56,5,59,5],[56,6,59,6],[56,7,57,7],[61,17,62,17],[61,18,62,24],[62,7,63,7],[63,1,63,2],[63,3,63,4],[61,16,62,16],[64,0,67,0],[64,1,64,2],[64,3,66,4],[64,5,67,5],[64,6,67,6],[60,11,63,11],[61,1,62,2],[61,8,62,8],[61,9,62,9],[61,10,62,10],[60,0,63,0],[60,1,60,2],[60,3,62,4],[60,5,63,5],[60,6,63,6],[60,7,61,7],[64,7,65,7],[64,11,67,11],[65,1,66,2],[65,8,66,8],[65,9,66,9],[65,10,66,10],[66,7,67,7],[67,1,67,2],[67,3,67,4],[68,11,71,11],[69,1,70,2],[69,8,70,8],[69,9,70,9],[69,10,70,10],[70,7,71,7],[71,1,71,2],[71,3,71,4],[68,0,71,0],[68,1,68,2],[68,3,70,4],[68,5,71,5],[68,6,71,6],[68,7,69,7],[72,11,75,11],[73,1,74,2],[73,8,74,8],[73,9,74,9],[73,10,74,10],[74,7,75,7],[75,1,75,2],[75,3,75,4],[72,0,75,0],[72,1,72,2],[72,3,74,4],[72,5,75,5],[72,6,75,6],[72,7,73,7],[108,2,108,6],[108,8,108,11],[109,2,109,6],[109,8,109,11],[110,2,110,6],[110,8,110,11],[76,1,76,11],[99,1,101,11],[103,4,103,6],[105,1,105,11],[106,2,106,11],[107,1,107,6],[107,7,107,11],[114,2,114,6],[114,8,114,11],[119,1,120,4],[122,1,123,4],[132,3,132,4],[133,1,133,4],[111,2,111,6],[111,8,111,11],[112,2,112,6],[112,8,112,11],[113,2,113,6],[113,8,113,11],[139,1,140,2],[139,3,139,5],[139,6,139,8],[139,9,139,11],[140,3,140,5],[140,6,140,8],[140,9,140,11],[134,1,134,4],[135,1,136,4],[137,1,138,5],[137,6,137,7],[137,8,137,9],[137,10,137,11],[138,6,138,7],[138,8,138,9],[138,10,138,11],[152,1,153,5],[152,6,152,7],[152,8,152,9],[152,10,152,11],[153,6,153,7],[153,8,153,9],[153,10,153,11],[141,6,141,7],[141,9,141,10],[147,3,147,4],[148,1,148,4],[149,1,149,4],[150,1,151,4],[156,6,156,7],[156,9,156,10],[162,3,162,4],[163,1,163,4],[164,1,164,4],[165,1,166,4],[154,1,155,2],[154,3,154,5],[154,6,154,8],[154,9,154,11],[155,3,155,5],[155,6,155,8],[155,9,155,11],[169,1,170,2],[169,3,169,5],[169,6,169,8],[169,9,169,11],[170,3,170,5],[170,6,170,8],[170,9,170,11],[167,1,168,5],[167,6,167,7],[167,8,167,9],[167,10,167,11],[168,6,168,7],[168,8,168,9],[168,10,168,11],[182,1,183,5],[182,6,182,7],[182,8,182,9],[182,10,182,11],[183,6,183,7],[183,8,183,9],[183,10,183,11],[171,6,171,7],[171,9,171,10],[177,3,177,4],[178,1,178,4],[179,1,179,4],[180,1,181,4],[186,6,186,7],[186,9,186,10],[192,3,192,4],[193,1,193,4],[194,1,194,4],[195,1,196,4],[184,1,185,2],[184,3,184,5],[184,6,184,8],[184,9,184,11],[185,3,185,5],[185,6,185,8],[185,9,185,11],[199,1,200,2],[199,3,199,5],[199,6,199,8],[199,9,199,11],[200,3,200,5],[200,6,200,8],[200,9,200,11],[197,1,198,5],[197,6,197,7],[197,8,197,9],[197,10,197,11],[198,6,198,7],[198,8,198,9],[198,10,198,11],[212,1,213,5],[212,6,212,7],[212,8,212,9],[212,10,212,11],[213,6,213,7],[213,8,213,9],[213,10,213,11],[201,6,201,7],[201,9,201,10],[207,3,207,4],[208,1,208,4],[209,1,209,4],[210,1,211,4],[216,6,216,7],[216,9,216,10],[222,3,222,4],[223,1,223,4],[224,1,224,4],[225,1,226,4],[214,1,215,2],[214,3,214,5],[214,6,214,8],[214,9,214,11],[215,3,215,5],[215,6,215,8],[215,9,215,11],[229,1,230,2],[229,3,229,5],[229,6,229,8],[229,9,229,11],[230,3,230,5],[230,6,230,8],[230,9,230,11],[227,1,228,5],[227,6,227,7],[227,8,227,9],[227,10,227,11],[228,6,228,7],[228,8,228,9],[228,10,228,11],[242,1,243,5],[242,6,242,7],[242,8,242,9],[242,10,242,11],[243,6,243,7],[243,8,243,9],[243,10,243,11],[231,6,231,7],[231,9,231,10],[237,3,237,4],[238,1,238,4],[239,1,239,4],[240,1,241,4],[246,6,246,7],[246,9,246,10],[252,3,252,4],[253,1,253,4],[254,1,254,4],[255,1,256,4],[244,1,245,2],[244,3,244,5],[244,6,244,8],[244,9,244,11],[245,3,245,5],[245,6,245,8],[245,9,245,11],[259,1,260,2],[259,3,259,5],[259,6,259,8],[259,9,259,11],[260,3,260,5],[260,6,260,8],[260,9,260,11],[257,1,258,5],[257,6,257,7],[257,8,257,9],[257,10,257,11],[258,6,258,7],[258,8,258,9],[258,10,258,11],[272,1,273,5],[272,6,272,7],[272,8,272,9],[272,10,272,11],[273,6,273,7],[273,8,273,9],[273,10,273,11],[261,6,261,7],[261,9,261,10],[267,3,267,4],[268,1,268,4],[269,1,269,4],[270,1,271,4],[276,6,276,7],[276,9,276,10],[282,3,282,4],[283,1,283,4],[284,1,284,4],[285,1,286,4],[274,1,275,2],[274,3,274,5],[274,6,274,8],[274,9,274,11],[275,3,275,5],[275,6,275,8],[275,9,275,11],[289,1,290,2],[289,3,289,5],[289,6,289,8],[289,9,289,11],[290,3,290,5],[290,6,290,8],[290,9,290,11],[287,1,288,5],[287,6,287,7],[287,8,287,9],[287,10,287,11],[288,6,288,7],[288,8,288,9],[288,10,288,11],[302,1,303,5],[302,6,302,7],[302,8,302,9],[302,10,302,11],[303,6,303,7],[303,8,303,9],[303,10,303,11],[291,6,291,7],[291,9,291,10],[297,3,297,4],[298,1,298,4],[299,1,299,4],[300,1,301,4],[306,6,306,7],[306,9,306,10],[312,3,312,4],[313,1,313,4],[314,1,314,4],[315,1,316,4],[304,1,305,2],[304,3,304,5],[304,6,304,8],[304,9,304,11],[305,3,305,5],[305,6,305,8],[305,9,305,11],[319,1,320,2],[319,3,319,5],[319,6,319,8],[319,9,319,11],[320,3,320,5],[320,6,320,8],[320,9,320,11],[317,1,318,5],[317,6,317,7],[317,8,317,9],[317,10,317,11],[318,6,318,7],[318,8,318,9],[318,10,318,11],[332,1,333,5],[332,6,332,7],[332,8,332,9],[332,10,332,11],[333,6,333,7],[333,8,333,9],[333,10,333,11],[321,6,321,7],[321,9,321,10],[327,3,327,4],[328,1,328,4],[329,1,329,4],[330,1,331,4],[336,6,336,7],[336,9,336,10],[342,3,342,4],[343,1,343,4],[344,1,344,4],[345,1,346,4],[334,1,335,2],[334,3,334,5],[334,6,334,8],[334,9,334,11],[335,3,335,5],[335,6,335,8],[335,9,335,11],[349,1,350,2],[349,3,349,5],[349,6,349,8],[349,9,349,11],[350,3,350,5],[350,6,350,8],[350,9,350,11],[347,1,348,5],[347,6,347,7],[347,8,347,9],[347,10,347,11],[348,6,348,7],[348,8,348,9],[348,10,348,11],[386,1,386,4],[388,5,388,11],[412,7,412,9],[413,1,413,4],[415,5,415,11],[439,7,439,9],[351,6,351,7],[351,9,351,10],[358,7,358,9],[359,1,359,4],[361,5,361,11],[385,7,385,9],[494,1,494,4],[496,5,496,11],[520,7,520,9],[521,1,521,4],[523,5,523,11],[547,7,547,9],[440,1,440,4],[442,5,442,11],[466,7,466,9],[467,1,467,4],[469,5,469,11],[493,7,493,9],[602,1,602,4],[604,5,604,11],[628,7,628,9],[629,1,629,4],[631,5,631,11],[655,7,655,9],[548,1,548,4],[550,5,550,11],[574,7,574,9],[575,1,575,4],[577,5,577,11],[601,7,601,9],[710,1,710,4],[712,5,712,11],[736,7,736,9],[737,1,737,4],[739,5,739,11],[656,1,656,4],[658,5,658,11],[682,7,682,9],[683,1,683,4],[685,5,685,11],[709,7,709,9]]}
["Toto listí je jen úschovna formátů, ocaď ce formáty kopírují do ostatních listí při vkládání dat tam, aby se nevypucovávaly, je tedy potřeba sem dát všechyn změny formátování!!!!!!!!!!!!! - Staf 24.2.2023"]

{"sheet":"VFMOTO","index":2,"n_rows":741,"n_cols":29,"rows_kept":741,"cut":false,"hidden":false,"merged":[[155,6,155,8],[170,6,170,8],[185,6,185,8],[319,9,319,11],[231,9,231,10],[171,9,171,10],[171,6,171,7],[186,9,186,10],[186,6,186,7],[182,10,182,11],[228,8,228,9],[228,10,228,11],[306,9,306,10],[318,8,318,9],[246,9,246,10],[242,8,242,9],[275,9,275,11],[246,6,246,7],[229,6,229,8],[231,6,231,7],[305,9,305,11],[290,6,290,8],[305,6,305,8],[215,6,215,8],[230,6,230,8],[303,6,303,7],[317,6,317,7],[317,8,317,9],[155,9,155,11],[43,1,43,2],[41,1,42,2],[43,3,43,4],[45,8,46,8],[45,9,46,9],[45,10,46,10],[44,7,45,7],[46,7,47,7],[44,3,46,4],[44,5,47,5],[44,6,47,6],[57,10,58,10],[56,7,57,7],[58,7,59,7],[56,3,58,4],[59,3,59,4],[56,6,59,6],[152,10,152,11],[48,11,51,11],[35,1,35,2],[39,1,39,2],[24,1,24,2],[25,1,26,2],[28,1,28,2],[29,1,30,2],[32,1,32,2],[33,1,34,2],[36,1,36,2],[37,1,38,2],[40,1,40,2],[31,1,31,2],[17,8,18,8],[17,9,18,9],[17,10,18,10],[16,3,18,4],[18,7,19,7],[16,7,17,7],[21,8,22,8],[21,9,22,9],[21,10,22,10],[20,7,21,7],[22,7,23,7],[20,3,22,4],[16,5,19,5],[16,6,19,6],[40,3,42,4],[40,5,43,5],[40,6,43,6],[41,8,42,8],[40,7,41,7],[42,7,43,7],[41,9,42,9],[41,10,42,10],[61,16,62,16],[61,17,62,17],[69,8,70,8],[69,9,70,9],[69,10,70,10],[68,7,69,7],[70,7,71,7],[68,3,70,4],[68,11,71,11],[61,8,62,8],[61,9,62,9],[61,10,62,10],[60,7,61,7],[62,7,63,7],[60,3,62,4],[65,8,66,8],[65,9,66,9],[65,10,66,10],[64,7,65,7],[66,7,67,7],[64,3,66,4],[68,6,71,6],[60,11,63,11],[64,11,67,11],[37,8,38,8],[37,9,38,9],[37,10,38,10],[36,7,37,7],[38,7,39,7],[36,3,38,4],[39,3,39,4],[29,8,30,8],[29,9,30,9],[29,10,30,10],[28,7,29,7],[30,7,31,7],[28,5,31,5],[28,6,31,6],[31,3,31,4],[36,5,39,5],[36,6,39,6],[35,3,35,4],[52,11,55,11],[56,11,59,11],[49,9,50,9],[49,10,50,10],[48,7,49,7],[50,7,51,7],[53,8,54,8],[53,9,54,9],[53,10,54,10],[52,7,53,7],[54,7,55,7],[49,8,50,8],[57,8,58,8],[52,0,55,0],[56,0,59,0],[60,0,63,0],[64,0,67,0],[60,1,60,2],[57,1,58,2],[63,1,63,2],[49,1,50,2],[64,1,64,2],[65,1,66,2],[51,1,51,2],[68,0,71,0],[72,0,75,0],[56,5,59,5],[48,5,51,5],[52,5,55,5],[55,1,55,2],[45,1,46,2],[48,1,48,2],[61,1,62,2],[59,1,59,2],[52,1,52,2],[53,1,54,2],[56,1,56,2],[72,3,74,4],[68,5,71,5],[63,3,63,4],[55,3,55,4],[71,3,71,4],[47,1,47,2],[68,1,68,2],[69,1,70,2],[72,1,72,2],[44,0,47,0],[48,0,51,0],[113,8,113,11],[108,8,108,11],[137,6,137,7],[135,1,136,4],[133,1,133,4],[132,3,132,4],[182,1,183,5],[315,1,316,4],[334,3,334,5],[334,6,334,8],[334,9,334,11],[334,1,335,2],[335,9,335,11],[333,10,333,11],[333,8,333,9],[332,10,332,11],[332,8,332,9],[332,6,332,7],[333,6,333,7],[321,9,321,10],[321,6,321,7],[319,6,319,8],[318,6,318,7],[320,6,320,8],[114,8,114,11],[114,2,114,6],[119,1,120,4],[122,1,123,4],[72,5,75,5],[72,6,75,6],[64,5,67,5],[67,1,67,2],[67,3,67,4],[106,2,106,11],[72,11,75,11],[73,8,74,8],[73,9,74,9],[73,10,74,10],[72,7,73,7],[112,2,112,6],[113,2,113,6],[108,2,108,6],[109,2,109,6],[107,7,107,11],[75,3,75,4],[99,1,101,11],[112,8,112,11],[75,1,75,2],[60,5,63,5],[111,2,111,6],[107,1,107,6],[109,8,109,11],[105,1,105,11],[103,4,103,6],[76,1,76,11],[73,1,74,2],[44,1,44,2],[60,6,63,6],[48,3,50,4],[52,3,54,4],[64,6,67,6],[110,2,110,6],[74,7,75,7],[44,11,47,11],[71,1,71,2],[110,8,110,11],[111,8,111,11],[48,6,51,6],[51,3,51,4],[47,3,47,4],[52,6,55,6],[57,9,58,9],[156,9,156,10],[156,6,156,7],[155,3,155,5],[162,3,162,4],[154,1,155,2],[154,3,154,5],[134,1,134,4],[138,10,138,11],[138,8,138,9],[138,6,138,7],[147,3,147,4],[148,1,148,4],[140,9,140,11],[149,1,149,4],[139,1,140,2],[137,8,137,9],[153,6,153,7],[153,8,153,9],[153,10,153,11],[141,6,141,7],[141,9,141,10],[137,10,137,11],[139,9,139,11],[140,6,140,8],[170,3,170,5],[170,9,170,11],[163,1,163,4],[164,1,164,4],[165,1,166,4],[167,6,167,7],[167,1,168,5],[168,10,168,11],[169,3,169,5],[169,1,170,2],[167,8,167,9],[168,6,168,7],[168,8,168,9],[169,9,169,11],[167,10,167,11],[739,5,739,11],[342,3,342,4],[343,1,343,4],[344,1,344,4],[345,1,346,4],[347,6,347,7],[347,8,347,9],[347,10,347,11],[348,6,348,7],[348,8,348,9],[348,10,348,11],[712,5,712,11],[685,5,685,11],[658,5,658,11],[550,5,550,11],[523,5,523,11],[388,5,388,11],[737,1,737,4],[710,1,710,4],[656,1,656,4],[521,1,521,4],[575,1,575,4],[602,1,602,4],[385,7,385,9],[208,1,208,4],[209,1,209,4],[210,1,211,4],[213,8,213,9],[214,6,214,8],[227,1,228,5],[214,1,215,2],[224,1,224,4],[225,1,226,4],[227,6,227,7],[227,8,227,9],[215,3,215,5],[215,9,215,11],[222,3,222,4],[223,1,223,4],[212,8,212,9],[212,10,212,11],[213,6,213,7],[214,3,214,5],[227,10,227,11],[212,6,212,7],[212,1,213,5],[216,9,216,10],[216,6,216,7],[683,1,683,4],[359,1,359,4],[386,1,386,4],[631,5,631,11],[287,8,287,9],[287,10,287,11],[288,10,288,11],[288,6,288,7],[288,8,288,9],[287,6,287,7],[320,9,320,11],[291,9,291,10],[289,6,289,8],[289,9,289,11],[306,6,306,7],[304,6,304,8],[304,9,304,11],[317,10,317,11],[318,10,318,11],[629,1,629,4],[332,1,333,5],[413,1,413,4],[548,1,548,4],[440,1,440,4],[195,1,196,4],[197,6,197,7],[197,1,198,5],[197,8,197,9],[197,10,197,11],[198,6,198,7],[198,8,198,9],[198,10,198,11],[207,3,207,4],[199,1,200,2],[199,9,199,11],[200,3,200,5],[200,9,200,11],[201,9,201,10],[201,6,201,7],[199,3,199,5],[199,6,199,8],[200,6,200,8],[229,3,229,5],[230,3,230,5],[229,1,230,2],[244,6,244,8],[243,10,243,11],[245,3,245,5],[298,1,298,4],[302,1,303,5],[261,9,261,10],[290,9,290,11],[274,1,275,2],[230,9,230,11],[257,8,257,9],[257,10,257,11],[258,8,258,9],[258,10,258,11],[259,9,259,11],[303,10,303,11],[274,6,274,8],[274,9,274,11],[282,3,282,4],[283,1,283,4],[255,1,256,4],[303,8,303,9],[237,3,237,4],[238,1,238,4],[239,1,239,4],[240,1,241,4],[244,9,244,11],[245,9,245,11],[245,6,245,8],[252,3,252,4],[242,1,243,5],[244,1,245,2],[242,6,242,7],[242,10,242,11],[275,3,275,5],[253,1,253,4],[259,1,260,2],[267,3,267,4],[268,1,268,4],[273,10,273,11],[269,1,269,4],[270,1,271,4],[272,1,273,5],[260,9,260,11],[272,6,272,7],[260,6,260,8],[275,6,275,8],[257,1,258,5],[273,8,273,9],[284,1,284,4],[290,3,290,5],[289,1,290,2],[289,3,289,5],[287,1,288,5],[327,3,327,4],[312,3,312,4],[313,1,313,4],[319,1,320,2],[320,3,320,5],[319,3,319,5],[317,1,318,5],[299,1,299,4],[300,1,301,4],[297,3,297,4],[304,1,305,2],[304,3,304,5],[305,3,305,5],[314,1,314,4],[467,1,467,4],[494,1,494,4],[330,1,331,4],[329,1,329,4],[328,1,328,4],[361,5,361,11],[415,5,415,11],[442,5,442,11],[336,9,336,10],[336,6,336,7],[351,9,351,10],[351,6,351,7],[347,1,348,5],[412,8,412,9],[358,7,358,9],[335,3,335,5],[349,1,350,2],[349,3,349,5],[349,6,349,8],[349,9,349,11],[350,3,350,5],[350,9,350,11],[335,6,335,8],[350,6,350,8],[192,3,192,4],[193,1,193,4],[194,1,194,4],[137,1,138,5],[152,1,153,5],[140,3,140,5],[139,6,139,8],[139,3,139,5],[178,1,178,4],[169,6,169,8],[177,3,177,4],[150,1,151,4],[152,6,152,7],[152,8,152,9],[154,6,154,8],[154,9,154,11],[184,1,185,2],[184,3,184,5],[184,6,184,8],[182,8,182,9],[184,9,184,11],[185,3,185,5],[183,6,183,7],[183,8,183,9],[179,1,179,4],[285,1,286,4],[180,1,181,4],[182,6,182,7],[26,7,27,7],[24,3,26,4],[302,6,302,7],[302,8,302,9],[302,10,302,11],[257,6,257,7],[258,6,258,7],[259,6,259,8],[243,6,243,7],[243,8,243,9],[261,6,261,7],[276,9,276,10],[244,3,244,5],[254,1,254,4],[291,6,291,7],[272,8,272,9],[272,10,272,11],[273,6,273,7],[274,3,274,5],[276,6,276,7],[36,0,39,0],[40,0,43,0],[28,11,31,11],[32,11,35,11],[36,11,39,11],[13,5,15,5],[20,5,23,5],[20,6,23,6],[23,1,23,2],[23,3,23,4],[24,5,27,5],[27,1,27,2],[27,3,27,4],[19,3,19,4],[13,11,15,11],[16,11,19,11],[20,11,23,11],[24,11,27,11],[19,1,19,2],[15,1,15,2],[14,8,14,10],[24,7,25,7],[40,11,43,11],[24,6,27,6],[1,0,1,11],[25,8,26,8],[25,9,26,9],[25,10,26,10],[17,27,21,27],[6,0,6,8],[12,1,12,11],[10,1,10,11],[13,6,15,6],[10,13,10,14],[8,13,9,14],[9,16,10,18],[13,13,14,13],[13,14,14,14],[21,16,22,16],[21,17,22,17],[21,18,22,19],[21,20,22,21],[16,16,16,23],[8,16,8,18],[15,13,15,14],[17,16,18,24],[8,1,8,11],[16,1,16,2],[12,0,15,0],[16,0,19,0],[20,0,23,0],[24,0,27,0],[28,0,31,0],[32,0,35,0],[17,25,18,26],[32,6,35,6],[23,20,23,21],[28,3,30,4],[33,8,34,8],[33,9,34,9],[33,10,34,10],[32,7,33,7],[34,7,35,7],[32,3,34,4],[32,5,35,5],[17,1,18,2],[13,1,13,2],[14,1,14,2],[13,3,14,4],[15,3,15,4],[20,1,20,2],[21,1,22,2],[44,20,45,23],[46,20,47,23],[53,20,54,24],[61,18,62,24],[25,20,26,20],[25,21,26,21],[29,20,30,20],[29,21,30,21],[37,20,38,23],[33,20,34,20],[33,21,34,21],[41,20,42,20],[41,21,42,21],[228,6,228,7],[185,9,185,11],[213,10,213,11],[229,9,229,11],[214,9,214,11],[183,10,183,11],[682,8,682,9],[709,8,709,9],[736,8,736,9],[439,8,439,9],[466,8,466,9],[493,8,493,9],[520,8,520,9],[547,8,547,9],[574,8,574,9],[601,8,601,9],[628,8,628,9],[655,8,655,9],[469,5,469,11],[604,5,604,11],[496,5,496,11],[577,5,577,11],[259,3,259,5],[260,3,260,5]]}
[]
[{"$f":"CHOOSE(LJazyk,\"Volba hodnot měřiče a typu závěrky, pro daná čidla měnit jen typ závěrky, vzdálenosti jsou dány:\",\"Selection of meter values and shutter type, for given sensor changing only shutter type, distances are fixed:\")","v":"Selection of meter values and shutter type, for given sensor changing only shutter type, distances are fixed:"}]
[null,null,null,null,null,null,null,null,{"$f":"CHOOSE(LJazyk,\"Vzdálenost středů krajních čidel snímače pro měření formátu 6x6 cm: \",\"Distance of centres of sensor edge probes for 6x6 cm format measurements: \")","v":"Distance of centres of sensor edge probes for 6x6 cm format measurements: "},49.6,"mm"]
[null,null,null,null,null,null,null,null,{"$f":"CHOOSE(LJazyk,\"Vzdálenost středů kraj. čidel pro měření horizontálního běhu - kinofilm (36 mm): \",\"Distance of centres of edge probes for horizontal running - kinofilm (36 mm): \")","v":"Distance of centres of edge probes for horizontal running - kinofilm (36 mm): "},29.4,"mm"]
[null,null,null,null,null,null,null,null,{"$f":"CHOOSE(LJazyk,\"Vzdálenost středů krajních čidel pro měření vertikálního běhu - kinofilm (24 mm): \",\"Distance of centres of edge probes for vertical running - kinofilm (24 mm): \")","v":"Distance of centres of edge probes for vertical running - kinofilm (24 mm): "},18.3,"mm"]
[null,null,null,null,null,null,null,null,"Použitá vzdálenost krajních dijod čidla: ",{"$f":"IF(LEFT(TRIM(UPPER(J7)),1)=\"V\",J5,IF(LEFT(TRIM(UPPER(J7)),1)=\"6\",J3,J4))","v":29.4},"mm"]
[{"$f":"CHOOSE(LJazyk,\"Formát 6x6 (6), kinofilm s během vertikálním (V) nebo horizontálním (jiné): \",\"Format 6x6 (6), kinofilm with vertical (V) or horizontal (other) running: \")","v":"Format 6x6 (6), kinofilm with vertical (V) or horizontal (other) running: "},null,null,null,null,null,null,null,null,"H"]
[]
[null,null,null,null,null,null,null,null,null,null,null,null,null,"Povolená tolerance\nrozdílu rychlosti pláten:",null,null,{"$f":"CHOOSE(LJazyk,\"Počet platných číslic pro zobrazení\nČasu, Šířky štěrbiny a Rychlosti (pláten/štěrbiny)\",  \"Number of valid digits to display\nTime, Slit width and Velocity (curtains/slits)\")","v":"Number of valid digits to display\nTime, Slit width and Velocity (curtains/slits)"}]
[null,null,null,null,null,null,null,null,null,null,null,null,null,null,null,null,3]
[null,{"$f":"CHOOSE(LJazyk,CONCATENATE(\"Štěrbinová závěrka \",IF(LEFT(TRIM(UPPER(J7)),1)=\"6\",CONCATENATE(\"je formátu 6x6 cm, měřící vzdálenost \",ZaokrText(J3,3),\" mm\"),IF(LEFT(TRIM(UPPER(J7)),1)=\"V\",CONCATENATE(\"má vertikální běh, měřící vzdálenost \",ZaokrText(J5,3),\" mm\"),CONCATENATE(\"má horizontální běh, měřící vzdálenost \",ZaokrText(J4,3),\" mm\"))),IF(LEFT(TRIM(UPPER(J7)),1)<>\"6\",\", měřič VFMOTO a originální snímač.\",\", měřič VFMOTO a snímač 6x6.\")),\n    CONCATENATE(\"Focal-plane shutter \",IF(LEFT(TRIM(UPPER(J7)),1)=\"6\",CONCATENATE(\"has format 6x6 cm, meas. distance \",ZaokrText(J3,3),\" mm\"),IF(LEFT(TRIM(UPPER(J7)),1)=\"V\",CONCATENATE(\"with vertical run, meas. distance \",ZaokrText(J5,3),\" mm\"),CONCATENATE(\"with horizontal run, meas. distance \",ZaokrText(J4,3),\" mm\"))),IF(LEFT(TRIM(UPPER(J7)),1)<>\"6\",\", VFMOTO device and original sensor.\",\", VFMOTO device and sensor 6x6.\")))","v":"Focal-plane shutter with horizontal run, meas. distance 29,4 mm, VFMOTO device and original sensor."},null,null,null,null,null,null,null,null,null,null,null,1.5]
[]
[{"$f":"CHOOSE(LJazyk,\"číslo řádku\",  \"row number\")","v":"row number"},{"$f":"CHOOSE(LJazyk,\"Výsledky měření štěrbinové závěrky; odchylky, rozptyl a nepravidelnost dle DIN 19016-06.83\",  \"Shutter measurement results; deviations, variance and irregularity acc. to DIN 19016-06.83\")","v":"Shutter measurement results; deviations, variance and irregularity acc. to DIN 19016-06.83"}]
[null,{"$f":"CHOOSE(LJazyk,\"Nastavený čas\",\"Selected time\")","v":"Selected time"},null,{"$f":"CHOOSE(LJazyk,\"Průměrný\nzměřený čas\",  \"Average\nmeasured time\")","v":"Average\nmeasured time"},null,{"$f":"CHOOSE(LJazyk,\"Odchylka prům.\nzm. času\",  \"Deviation of meas. time\")","v":"Deviation of meas. time"},{"$f":"CHOOSE(LJazyk,\"Rozptyl\nměřených\nhodnot\",  \"Variance of meas. values\")","v":"Variance of meas. values"},{"$f":"CHOOSE(LJazyk,\" Rychlost\",\"Velocity \")","v":"Velocity "},null,null,null,{"$f":"CHOOSE(LJazyk,\"Nepravi- delnost\nr [-]\",  \"Irregu- larity\nr [-]\")","v":"Irregu- larity\nr [-]"},null,"Stř. čas a krajní časy","počet platných číslic pro ně"]
[null,{"$f":"CHOOSE(LJazyk,\"Nastavený čas dle DIN\",  \"Selected time DIN\")","v":"Selected time DIN"},null,null,null,null,null,{"$f":"CHOOSE(LJazyk,\"1. plátna\",  \"1. curtain\")","v":"1. curtain"},{"$f":"CHOOSE(LJazyk,\"v pozici běhu pláten/štěrbiny:\",  \"in point of run of curtains/slit:\")","v":"in point of run of curtains/slit:"},null,null,null,null,null,null,null,{"$f":"CHOOSE(LJazyk,\"Následující je pro gřaf a je tu proto, že\",  \"Following is for chart and is here because\")","v":"Following is for chart and is here because"}]
[null,{"$f":"CHOOSE(LJazyk,\"Povolené rozmezí\",  \"Allowed range\")","v":"Allowed range"},null,{"$f":"CHOOSE(LJazyk,\"ve středu obraz. okna\",  \"in centre of image box\")","v":"in centre of image box"},null,null,null,{"$f":"CHOOSE(LJazyk,\"2. plátna\",  \"2. curtain\")","v":"2. curtain"},{"$f":"CHOOSE(LJazyk,\"začátek\",  \"start\")","v":"start"},{"$f":"CHOOSE(LJazyk,\"střed\",  \"center\")","v":"center"},{"$f":"CHOOSE(LJazyk,\"konec\",  \"end\")","v":"end"},null,null,"dle DIN 19016-06.83",null,null,{"$f":"CHOOSE(LJazyk,\"1) ve zdrojových datech pro gřaf, dyš tam nic není, tak nemůže být \"\"\"\", ale musí tam být fuňkce ekscélu NEDEF() a\",  \"1) in source data for graph, if there is nothing there, there can't be \"\"\"\", but there must be a Excel fuction NA() and\")","v":"1) in source data for graph, if there is nothing there, there can't be \"\", but there must be a Excel fuction NA() and"}]
[1,{"$f":"IF(ISNUMBER(D133),D133,\"\")","v":""},null,{"$f":"IF(ISNUMBER(F134),IF(F134/1000000>=1,F134/1000000,1/(F134/1000000)),\"\")","v":""},null,{"$f":"IF(ISNUMBER(G141),G141,\"\")","v":""},{"$f":"IF(ISNUMBER(J141),J141,\"\")","v":""},{"$f":"IF(ISNUMBER(G135),G135,\"\")","v":""},{"$f":"IF(ISNUMBER(F137),IF(F137<=0, CHOOSE(LJazyk,\"Zavřeno!!\",  \"Closed!!\"), CONCATENATE(ZaokrText(IF(F137>=1000000,F137/1000000,F137/1000),$Q$10),IF(F137/1000000>=1,\" s\",\" ms\"))),\"\")","v":""},{"$f":"IF(ISNUMBER(G137),IF(G137<=0, CHOOSE(LJazyk,\"Zavřeno!!\",  \"Closed!!\"), CONCATENATE(ZaokrText(IF(G137>=1000000,G137/1000000,G137/1000),$Q$10),IF(G137/1000000>=1,\" s\",\" ms\"))),\"\")","v":""},{"$f":"IF(ISNUMBER(H137),IF(H137<=0, CHOOSE(LJazyk,\"Zavřeno!!\",  \"Closed!!\"),  CONCATENATE(ZaokrText(IF(H137>=1000000,H137/1000000,H137/1000),$Q$10),IF(H137/1000000>=1,\" s\",\" ms\"))),\"\")","v":""},{"$f":"IF(COUNT(F137:H137)>=3,IF( MIN(F137:H137)<=0, CHOOSE(LJazyk,\"Nelze\",  \"Can not\"), MAX(F137:H137)/MIN(F137:H137)),\"\")","v":""},null,{"$f":"IF(ISNUMBER(D133),OdchZmerCasuDIN(1/J361,1,\"Sol\")*1000,\"\")","v":""},{"$f":"IF(ISNUMBER(N17),IF(N17<1,3, IF(AND(N17>=10,N17<=20),4, IF(N17<=1000,3,4) )),\"\")","v":""},null,{"$f":"CHOOSE(LJazyk,\"2) mocninnný proklad nejde v ekscelu udělat pro nuly v buňkách (proto je tu proklad udělaný mou fuňkcí Polynom) a\",  \"2) interpolation of y = a * x^(b) function cannot be done in excel for zeros in cells (that's why the interpolation is done by my function Polynom) and\")","v":"2) interpolation of y = a * x^(b) function cannot be done in excel for zeros in cells (that's why the interpolation is done by my function Polynom) and"},null,null,null,null,null,null,null,null,null,null,null,{"$f":"CHOOSE(LJazyk,\"Poznámky:\",  \"Notes:\")","v":"Notes:"}]
[null,{"$f":"IF(ISNUMBER(D133),CONCATENATE(ZaokrText(N17,O17),\" ms\"),\"\")","v":""},null,null,null,null,null,null,{"$f":"IF(G139=\"\",\"\",IF(F137<=0, \"\", IF($J137<0,CONCATENATE(ZaokrText(G139,$Q$10),\" mm\"), CHOOSE(LJazyk,\"celé okno\",  \"full open\"))))","v":""},{"$f":"IF(I139=\"\",\"\",IF(G137<=0, \"\", IF($J137<0,CONCATENATE(ZaokrText(I139,$Q$10),\" mm\"), CHOOSE(LJazyk,\"celé okno\",  \"full open\"))))","v":""},{"$f":"IF(K139=\"\",\"\",IF(H137<=0, \"\", IF($J137<0,CONCATENATE(ZaokrText(K139,$Q$10),\" mm\"), CHOOSE(LJazyk,\"celé okno\",  \"full open\"))))","v":""},null,null,{"$f":"IF(ISNUMBER(D133),OdchZmerCasuDIN(1/J361,1,\"Min\")*1000,\"\")","v":""},{"$f":"IF(ISNUMBER(N18),IF(N18<1,2, IF(AND(N18>=10,N18<=20),4, IF(N18<=1000,3,4) )),\"\")","v":""},null,{"$f":"CHOOSE(LJazyk,\"3) když jsou některé buňky výběru prázdné (vynechaná datata) tak gřafu nejde říct aby byl bodový - přepíná sááám X vosu na herteple (tzv. kategooryje), blbouňi nejapní !!!\",  \"3) when some cells of selection are empty (omitted dates) chart can't be told to be point - Excel switches itself X axis to potatoes or something similarly piece wise (so-called categories), stupid fools !!!\")","v":"3) when some cells of selection are empty (omitted dates) chart can't be told to be point - Excel switches itself X axis to potatoes or something similarly piece wise (so-called categories), stupid fools !!!"},null,null,null,null,null,null,null,null,{"$f":"CHOOSE(LJazyk,\"\"\"Vyhlazení\"\" změřených dat polynomem\",  \"Polynomial \"\"smoothing\"\" of measured data\")","v":"Polynomial \"smoothing\" of measured data"},null,{"$f":"CHOOSE(LJazyk,\"Y hodnoty pro \"\"rovnici závěrky\"\" podle rovnice zobrazované pod grafem\",  \"Y values for \"\"shutter equation\"\" acc. to equation shown below graph\")","v":"Y values for \"shutter equation\" acc. to equation shown below graph"}]
[null,null,null,null,null,null,null,{"$f":"IF(ISNUMBER(H135),H135,\"\")","v":""},null,null,null,null,null,{"$f":"IF(ISNUMBER(D133),OdchZmerCasuDIN(1/J361,1,\"Max\")*1000,\"\")","v":""},{"$f":"IF(ISNUMBER(N19),IF(N19<1,2, IF(AND(N19>=10,N19<=20),4, IF(N19<=1000,3,4) )),\"\")","v":""}]
[null,{"$f":"IF(ISNUMBER(D133),CONCATENATE(ZaokrText(N18,O18),\" ms - \",ZaokrText(N19,O19),\" ms\"),\"\")","v":""},null,{"$f":"IF(ISNUMBER(F134),F134/1000,\"\")","v":""},null,null,null,null,{"$f":"IF(G139=\"\",\"\",IF($J137<0,CONCATENATE(ZaokrText(G139/(F137*0.001),$Q$10),\" m/s\"),\"\"))","v":""},{"$f":"IF(I139=\"\",\"\",IF($J137<0,CONCATENATE(ZaokrText(I139/(G137*0.001),$Q$10),\" m/s\"),\"\"))","v":""},{"$f":"IF(K139=\"\",\"\",IF($J137<0,CONCATENATE(ZaokrText(K139/(H137*0.001),$Q$10),\" m/s\"),\"\"))","v":""},null,null,{"$f":"IF(ISNUMBER(D148),OdchZmerCasuDIN(1/J388,1,\"Sol\")*1000,\"\")","v":""},{"$f":"IF(ISNUMBER(N20),IF(N20<1,3, IF(AND(N20>=10,N20<=20),4, IF(N20<=1000,3,4) )),\"\")","v":""},null,{"$f":"CHOOSE(LJazyk,\"4) a dále taky následující tabulku nejde schovat, poáč dyš se schová tak se schová aji graf!!!!!\",  \"4) and also following table can not be hidden, because when it is hidden, graph is hidden too !!!!!\")","v":"4) and also following table can not be hidden, because when it is hidden, graph is hidden too !!!!!"},null,null,null,null,null,null,null,null,{"$f":"CHOOSE(LJazyk,\"Optim. st. polyn. transf. dat:\",  \"Optimal polynomial degree:\")","v":"Optimal polynomial degree:"},{"$f":"Opt_Stupen_Polynomu(S24:T53,TRUE)","v":"Nelze"},null,{"$f":"CHOOSE(LJazyk,\"- funkce MIN a MAX sice vrací jen čísla, ALE vrátí taky chybové hlášení když se nějaké (aspoň jedno) v oblasti vyskytne.\",  \" - MIN and MAX functions return only numbers, BUT they also return an error message when some error message (at least one) occurs in the area.\")","v":" - MIN and MAX functions return only numbers, BUT they also return an error message when some error message (at least one) occurs in the area."}]
[2,{"$f":"IF(ISNUMBER(D148),D148,\"\")","v":""},null,{"$f":"IF(ISNUMBER(F149),IF(F149/1000000>=1,F149/1000000,1/(F149/1000000)),\"\")","v":""},null,{"$f":"IF(ISNUMBER(G156),G156,\"\")","v":""},{"$f":"IF(ISNUMBER(J156),J156,\"\")","v":""},{"$f":"IF(ISNUMBER(G150),G150,\"\")","v":""},{"$f":"IF(ISNUMBER(F152),IF(F152<=0, CHOOSE(LJazyk,\"Zavřeno!!\",  \"Closed!!\"),  CONCATENATE(ZaokrText(IF(F152>=1000000,F152/1000000,F152/1000),$Q$10),IF(F152/1000000>=1,\" s\",\" ms\"))),\"\")","v":""},{"$f":"IF(ISNUMBER(G152),IF(G152<=0, CHOOSE(LJazyk,\"Zavřeno!!\",  \"Closed!!\"),  CONCATENATE(ZaokrText(IF(G152>=1000000,G152/1000000,G152/1000),$Q$10),IF(G152/1000000>=1,\" s\",\" ms\"))),\"\")","v":""},{"$f":"IF(ISNUMBER(H152),IF(H152<=0, CHOOSE(LJazyk,\"Zavřeno!!\",  \"Closed!!\"),  CONCATENATE(ZaokrText(IF(H152>=1000000,H152/1000000,H152/1000),$Q$10),IF(H152/1000000>=1,\" s\",\" ms\"))),\"\")","v":""},{"$f":"IF(COUNT(F152:H152)>=3, IF( MIN(F152:H152)<=0,CHOOSE(LJazyk,\"Nelze\",  \"Can not\"), MAX(F152:H152)/MIN(F152:H152)),\"\")","v":""},null,{"$f":"IF(ISNUMBER(D148),OdchZmerCasuDIN(1/J388,1,\"Min\")*1000,\"\")","v":""},{"$f":"IF(ISNUMBER(N21),IF(N21<1,2, IF(AND(N21>=10,N21<=20),4, IF(N21<=1000,3,4) )),\"\")","v":""},null,{"$f":"CHOOSE(LJazyk,\"Zdrojová data pro gřaf:\",  \"Source data for chart:\")","v":"Source data for chart:"},null,null,null,null,null,null,null,null,{"$f":"CHOOSE(LJazyk,\"Minimum netransf. X:\",  \"Minimum untransformed X:\")","v":"Minimum untransformed X:"},{"$f":"IF(COUNT(Q24:Q53)>1,EXP(MIN(S24:S53)),\"\")","v":""},null,{"$f":"CHOOSE(LJazyk,\" - Y hodnoty pro vyhlazení polynomem jsou zařazeny jen když je stupeň polynomu > 1, páč dvě stejné čáry by stejně nebyly koukati viděti…\",  \" - Y values for polynomial smoothing are only included when the degree of the polynomial > 1, because two identical lines would not be visible anyway...\")","v":" - Y values for polynomial smoothing are only included when the degree of the polynomial > 1, because two identical lines would not be visible anyway..."}]
[null,{"$f":"IF(ISNUMBER(D148),CONCATENATE(ZaokrText(N20,O20),\" ms\"),\"\")","v":""},null,null,null,null,null,null,{"$f":"IF(G154=\"\",\"\",IF(F152<=0, \"\", IF($J152<0,CONCATENATE(ZaokrText(G154,$Q$10),\" mm\"), CHOOSE(LJazyk,\"celé okno\",  \"full open\"))))","v":""},{"$f":"IF(I154=\"\",\"\",IF(G152<=0, \"\", IF($J152<0,CONCATENATE(ZaokrText(I154,$Q$10),\" mm\"), CHOOSE(LJazyk,\"celé okno\",  \"full open\"))))","v":""},{"$f":"IF(K154=\"\",\"\",IF(H152<=0, \"\", IF($J152<0,CONCATENATE(ZaokrText(K154,$Q$10),\" mm\"), CHOOSE(LJazyk,\"celé okno\",  \"full open\"))))","v":""},null,null,{"$f":"IF(ISNUMBER(D148),OdchZmerCasuDIN(1/J388,1,\"Max\")*1000,\"\")","v":""},{"$f":"IF(ISNUMBER(N22),IF(N22<1,2, IF(AND(N22>=10,N22<=20),4, IF(N22<=1000,3,4) )),\"\")","v":""},null,{"$f":"CHOOSE(LJazyk,\"Nastavený čas 1/s\",  \"Selected time 1/s\")","v":"Selected time 1/s"},{"$f":"CHOOSE(LJazyk,\"Stř. změřený čas 1/s\",  \"Aver. meas. time 1/s\")","v":"Aver. meas. time 1/s"},{"$f":"CHOOSE(LJazyk,\"Logaritmická (přiroz.) transformace obouch dat\",  \"Logarithmic transformation of both data\")","v":"Logarithmic transformation of both data"},null,{"$f":"CHOOSE(LJazyk,\"Hodnoty rozsahu pro rozsah\",  \"Range values for the range\")","v":"Range values for the range"},null,null,null,null,{"$f":"CHOOSE(LJazyk,\"Maximum netransf. X:\",  \"Maximum untransformed X:\")","v":"Maximum untransformed X:"},{"$f":"IF(COUNT(Q24:Q53)>1,EXP(MAX(S24:S53)),\"\")","v":""}]
[null,null,null,null,null,null,null,{"$f":"IF(ISNUMBER(H150),H150,\"\")","v":""},null,null,null,null,null,{"$f":"IF(ISNUMBER(D163),OdchZmerCasuDIN(1/J415,1,\"Sol\")*1000,\"\")","v":""},{"$f":"IF(ISNUMBER(N23),IF(N23<1,3, IF(AND(N23>=10,N23<=20),4, IF(N23<=1000,3,4) )),\"\")","v":""},null,null,null,null,null,null,null,null,null,null,{"$f":"CHOOSE(LJazyk,\"X  (netransf. a logar. krok)\",  \"X (non-transf. and log. step)\")","v":"X (non-transf. and log. step)"},{"$f":"CHOOSE(LJazyk,\"Y (netransf.)\",  \"Y (non-transf.)\")","v":"Y (non-transf.)"},{"$f":"CHOOSE(LJazyk,\"Y (netransf.)\",  \"Y (non-transf.)\")","v":"Y (non-transf.)"}]
[null,{"$f":"IF(ISNUMBER(D148),CONCATENATE(ZaokrText(N21,O21),\" ms - \",ZaokrText(N22,O22),\" ms\"),\"\")","v":""},null,{"$f":"IF(ISNUMBER(F149),F149/1000,\"\")","v":""},null,null,null,null,{"$f":"IF(G154=\"\",\"\",IF($J152<0,CONCATENATE(ZaokrText(G154/(F152*0.001),$Q$10),\" m/s\"),\"\"))","v":""},{"$f":"IF(I154=\"\",\"\",IF($J152<0,CONCATENATE(ZaokrText(I154/(G152*0.001),$Q$10),\" m/s\"),\"\"))","v":""},{"$f":"IF(K154=\"\",\"\",IF($J152<0,CONCATENATE(ZaokrText(K154/(H152*0.001),$Q$10),\" m/s\"),\"\"))","v":""},null,null,{"$f":"IF(ISNUMBER(D163),OdchZmerCasuDIN(1/J415,1,\"Min\")*1000,\"\")","v":""},{"$f":"IF(ISNUMBER(N24),IF(N24<1,2, IF(AND(N24>=10,N24<=20),4, IF(N24<=1000,3,4) )),\"\")","v":""},null,{"$f":"IF(AND(ISNUMBER(B17),ISNUMBER(J361)),J361,NA())","v":{"$error":"#N/A"}},{"$f":"IF(AND(ISNUMBER(D17),ISNUMBER(J361)),1/(F134/1000000),NA())","v":{"$error":"#N/A"}},{"$f":"IF(ISNUMBER(Q24),LN(Q24),\"\")","v":""},{"$f":"IF(ISNUMBER(R24),LN(R24),\"\")","v":""},{"$f":"CHOOSE(LJazyk,\"a nakreslení závislosti 1:1\",  \"and draw 1:1 dependency\")","v":"and draw 1:1 dependency"},null,null,null,null,{"$f":"IF(COUNT($AA$21:$AA$22)=2,EXP(LN($AA$21)+(ROW(Z24)-ROW($Z$24))*(LN($AA$22)-LN($AA$21))/(ROWS($Z$24:$Z$59)-1)),NA())","v":{"$error":"#N/A"}},{"$f":"IF(NOT(ISNUMBER($AA$20)),NA(),IF($AA$20>1,      EXP(N(Polynom($S$24:$T$53,$AA$20,TRUE,\"K\",0))+N(Polynom($S$24:$T$53,$AA$20,TRUE,\"K\",1))*LN(Z24)+N(Polynom($S$24:$T$53,$AA$20,TRUE,\"K\",2))*LN(Z24)^2+N(Polynom($S$24:$T$53,$AA$20,TRUE,\"K\",3))*LN(Z24)^3+N(Polynom($S$24:$T$53,$AA$20,TRUE,\"K\",4))*LN(Z24)^4+N(Polynom($S$24:$T$53,$AA$20,TRUE,\"K\",5))*LN(Z24)^5+N(Polynom($S$24:$T$53,$AA$20,TRUE,\"K\",6))*LN(Z24)^6+N(Polynom($S$24:$T$53,$AA$20,TRUE,\"K\",7))*LN(Z24)^7+N(Polynom($S$24:$T$53,$AA$20,TRUE,\"K\",8))*LN(Z24)^8+N(Polynom($S$24:$T$53,$AA$20,TRUE,\"K\",9))*LN(Z24)^9+N(Polynom($S$24:$T$53,$AA$20,TRUE,\"K\",10))*LN(Z24)^10),NA()))","v":{"$error":"#N/A"}},{"$f":"IF(AND(ISNUMBER(Z24),ISNUMBER($U$42),ISNUMBER($V$42)),$U$42*Z24^$V$42, NA())","v":{"$error":"#N/A"}}]
[3,{"$f":"IF(ISNUMBER(D163),D163,\"\")","v":""},null,{"$f":"IF(ISNUMBER(F164),IF(F164/1000000>=1,F164/1000000,1/(F164/1000000)),\"\")","v":""},null,{"$f":"IF(ISNUMBER(G171),G171,\"\")","v":""},{"$f":"IF(ISNUMBER(J171),J171,\"\")","v":""},{"$f":"IF(ISNUMBER(G165),G165,\"\")","v":""},{"$f":"IF(ISNUMBER(F167),IF(F167<=0, CHOOSE(LJazyk,\"Zavřeno!!\",  \"Closed!!\"),  CONCATENATE(ZaokrText(IF(F167>=1000000,F167/1000000,F167/1000),$Q$10),IF(F167/1000000>=1,\" s\",\" ms\"))),\"\")","v":""},{"$f":"IF(ISNUMBER(G167),IF(G167<=0, CHOOSE(LJazyk,\"Zavřeno!!\",  \"Closed!!\"),  CONCATENATE(ZaokrText(IF(G167>=1000000,G167/1000000,G167/1000),$Q$10),IF(G167/1000000>=1,\" s\",\" ms\"))),\"\")","v":""},{"$f":"IF(ISNUMBER(H167),IF(H167<=0, CHOOSE(LJazyk,\"Zavřeno!!\",  \"Closed!!\"),  CONCATENATE(ZaokrText(IF(H167>=1000000,H167/1000000,H167/1000),$Q$10),IF(H167/1000000>=1,\" s\",\" ms\"))),\"\")","v":""},{"$f":"IF(COUNT(F167:H167)>=3, IF( MIN(F167:H167)<=0,CHOOSE(LJazyk,\"Nelze\",  \"Can not\"), MAX(F167:H167)/MIN(F167:H167)),\"\")","v":""},null,{"$f":"IF(ISNUMBER(D163),OdchZmerCasuDIN(1/J415,1,\"Max\")*1000,\"\")","v":""},{"$f":"IF(ISNUMBER(N25),IF(N25<1,2, IF(AND(N25>=10,N25<=20),4, IF(N25<=1000,3,4) )),\"\")","v":""}]
[null,{"$f":"IF(ISNUMBER(D163),CONCATENATE(ZaokrText(N23,O23),\" ms\"),\"\")","v":""},null,null,null,null,null,null,{"$f":"IF(G169=\"\",\"\",IF(F167<=0, \"\", IF($J167<0,CONCATENATE(ZaokrText(G169,$Q$10),\" mm\"), CHOOSE(LJazyk,\"celé okno\",  \"full open\"))))","v":""},{"$f":"IF(I169=\"\",\"\",IF(G167<=0, \"\", IF($J167<0,CONCATENATE(ZaokrText(I169,$Q$10),\" mm\"), CHOOSE(LJazyk,\"celé okno\",  \"full open\"))))","v":""},{"$f":"IF(K169=\"\",\"\",IF(H167<=0, \"\", IF($J167<0,CONCATENATE(ZaokrText(K169,$Q$10),\" mm\"), CHOOSE(LJazyk,\"celé okno\",  \"full open\"))))","v":""},null,null,{"$f":"IF(ISNUMBER(D178),OdchZmerCasuDIN(1/J442,1,\"Sol\")*1000,\"\")","v":""},{"$f":"IF(ISNUMBER(N26),IF(N26<1,3, IF(AND(N26>=10,N26<=20),4, IF(N26<=1000,3,4) )),\"\")","v":""},null,{"$f":"IF(AND(ISNUMBER(B21),ISNUMBER(J388)),J388,NA())","v":{"$error":"#N/A"}},{"$f":"IF(AND(ISNUMBER(D21),ISNUMBER(J388)),1/(F149/1000000),NA())","v":{"$error":"#N/A"}},{"$f":"IF(ISNUMBER(Q26),LN(Q26),\"\")","v":""},{"$f":"IF(ISNUMBER(R26),LN(R26),\"\")","v":""},{"$f":"CHOOSE(LJazyk,\"x osa\",  \"x axis\")","v":"x axis"},{"$f":"CHOOSE(LJazyk,\"y osa\",  \"y axis\")","v":"y axis"},null,null,null,{"$f":"IF(COUNT($AA$21:$AA$22)=2,EXP(LN($AA$21)+(ROW(Z26)-ROW($Z$24))*(LN($AA$22)-LN($AA$21))/(ROWS($Z$24:$Z$59)-1)),NA())","v":{"$error":"#N/A"}},{"$f":"IF(NOT(ISNUMBER($AA$20)),NA(),IF($AA$20>1,     EXP(N(Polynom($S$24:$T$53,$AA$20,TRUE,\"K\",0))+N(Polynom($S$24:$T$53,$AA$20,TRUE,\"K\",1))*LN(Z26)+N(Polynom($S$24:$T$53,$AA$20,TRUE,\"K\",2))*LN(Z26)^2+N(Polynom($S$24:$T$53,$AA$20,TRUE,\"K\",3))*LN(Z26)^3+N(Polynom($S$24:$T$53,$AA$20,TRUE,\"K\",4))*LN(Z26)^4+N(Polynom($S$24:$T$53,$AA$20,TRUE,\"K\",5))*LN(Z26)^5+N(Polynom($S$24:$T$53,$AA$20,TRUE,\"K\",6))*LN(Z26)^6+N(Polynom($S$24:$T$53,$AA$20,TRUE,\"K\",7))*LN(Z26)^7+N(Polynom($S$24:$T$53,$AA$20,TRUE,\"K\",8))*LN(Z26)^8+N(Polynom($S$24:$T$53,$AA$20,TRUE,\"K\",9))*LN(Z26)^9+N(Polynom($S$24:$T$53,$AA$20,TRUE,\"K\",10))*LN(Z26)^10),NA()))","v":{"$error":"#N/A"}},{"$f":"IF(AND(ISNUMBER(Z26),ISNUMBER($U$42),ISNUMBER($V$42)),$U$42*Z26^$V$42, NA())","v":{"$error":"#N/A"}}]
[null,null,null,null,null,null,null,{"$f":"IF(ISNUMBER(H165),H165,\"\")","v":""},null,null,null,null,null,{"$f":"IF(ISNUMBER(D178),OdchZmerCasuDIN(1/J442,1,\"Min\")*1000,\"\")","v":""},{"$f":"IF(ISNUMBER(N27),IF(N27<1,2, IF(AND(N27>=10,N27<=20),4, IF(N27<=1000,3,4) )),\"\")","v":""}]
[null,{"$f":"IF(ISNUMBER(D163),CONCATENATE(ZaokrText(N24,O24),\" ms - \",ZaokrText(N25,O25),\" ms\"),\"\")","v":""},null,{"$f":"IF(ISNUMBER(F164),F164/1000,\"\")","v":""},null,null,null,null,{"$f":"IF(G169=\"\",\"\",IF($J167<0,CONCATENATE(ZaokrText(G169/(F167*0.001),$Q$10),\" m/s\"),\"\"))","v":""},{"$f":"IF(I169=\"\",\"\",IF($J167<0,CONCATENATE(ZaokrText(I169/(G167*0.001),$Q$10),\" m/s\"),\"\"))","v":""},{"$f":"IF(K169=\"\",\"\",IF($J167<0,CONCATENATE(ZaokrText(K169/(H167*0.001),$Q$10),\" m/s\"),\"\"))","v":""},null,null,{"$f":"IF(ISNUMBER(D178),OdchZmerCasuDIN(1/J442,1,\"Max\")*1000,\"\")","v":""},{"$f":"IF(ISNUMBER(N28),IF(N28<1,2, IF(AND(N28>=10,N28<=20),4, IF(N28<=1000,3,4) )),\"\")","v":""},null,{"$f":"IF(AND(ISNUMBER(B25),ISNUMBER(J415)),J415,NA())","v":{"$error":"#N/A"}},{"$f":"IF(AND(ISNUMBER(D25),ISNUMBER(J415)),1/(F164/1000000),NA())","v":{"$error":"#N/A"}},{"$f":"IF(ISNUMBER(Q28),LN(Q28),\"\")","v":""},{"$f":"IF(ISNUMBER(R28),LN(R28),\"\")","v":""},{"$f":"IF(COUNT(S24:S53)>0,10^(INT(LOG10(EXP(MIN(S24:T53))))),1)","v":1},{"$f":"IF(COUNT(T24:T53)>0,10^(INT(LOG10(EXP(MIN(S24:T53))))),1)","v":1},null,null,null,{"$f":"IF(COUNT($AA$21:$AA$22)=2,EXP(LN($AA$21)+(ROW(Z28)-ROW($Z$24))*(LN($AA$22)-LN($AA$21))/(ROWS($Z$24:$Z$59)-1)),NA())","v":{"$error":"#N/A"}},{"$f":"IF(NOT(ISNUMBER($AA$20)),NA(),IF($AA$20>1,     EXP(N(Polynom($S$24:$T$53,$AA$20,TRUE,\"K\",0))+N(Polynom($S$24:$T$53,$AA$20,TRUE,\"K\",1))*LN(Z28)+N(Polynom($S$24:$T$53,$AA$20,TRUE,\"K\",2))*LN(Z28)^2+N(Polynom($S$24:$T$53,$AA$20,TRUE,\"K\",3))*LN(Z28)^3+N(Polynom($S$24:$T$53,$AA$20,TRUE,\"K\",4))*LN(Z28)^4+N(Polynom($S$24:$T$53,$AA$20,TRUE,\"K\",5))*LN(Z28)^5+N(Polynom($S$24:$T$53,$AA$20,TRUE,\"K\",6))*LN(Z28)^6+N(Polynom($S$24:$T$53,$AA$20,TRUE,\"K\",7))*LN(Z28)^7+N(Polynom($S$24:$T$53,$AA$20,TRUE,\"K\",8))*LN(Z28)^8+N(Polynom($S$24:$T$53,$AA$20,TRUE,\"K\",9))*LN(Z28)^9+N(Polynom($S$24:$T$53,$AA$20,TRUE,\"K\",10))*LN(Z28)^10),NA()))","v":{"$error":"#N/A"}},{"$error":"#N/A"}]
[4,{"$f":"IF(ISNUMBER(D178),D178,\"\")","v":""},null,{"$f":"IF(ISNUMBER(F179),IF(F179/1000000>=1,F179/1000000,1/(F179/1000000)),\"\")","v":""},null,{"$f":"IF(ISNUMBER(G186),G186,\"\")","v":""},{"$f":"IF(ISNUMBER(J186),J186,\"\")","v":""},{"$f":"IF(ISNUMBER(G180),G180,\"\")","v":""},{"$f":"IF(ISNUMBER(F182),IF(F182<=0, CHOOSE(LJazyk,\"Zavřeno!!\",  \"Closed!!\"),  CONCATENATE(ZaokrText(IF(F182>=1000000,F182/1000000,F182/1000),$Q$10),IF(F182/1000000>=1,\" s\",\" ms\"))),\"\")","v":""},{"$f":"IF(ISNUMBER(G182),IF(G182<=0, CHOOSE(LJazyk,\"Zavřeno!!\",  \"Closed!!\"),  CONCATENATE(ZaokrText(IF(G182>=1000000,G182/1000000,G182/1000),$Q$10),IF(G182/1000000>=1,\" s\",\" ms\"))),\"\")","v":""},{"$f":"IF(ISNUMBER(H182),IF(H182<=0, CHOOSE(LJazyk,\"Zavřeno!!\",  \"Closed!!\"),  CONCATENATE(ZaokrText(IF(H182>=1000000,H182/1000000,H182/1000),$Q$10),IF(H182/1000000>=1,\" s\",\" ms\"))),\"\")","v":""},{"$f":"IF(COUNT(F182:H182)>=3, IF( MIN(F182:H182)<=0,CHOOSE(LJazyk,\"Nelze\",  \"Can not\"), MAX(F182:H182)/MIN(F182:H182)),\"\")","v":""},null,{"$f":"IF(ISNUMBER(D193),OdchZmerCasuDIN(1/J469,1,\"Sol\")*1000,\"\")","v":""},{"$f":"IF(ISNUMBER(N29),IF(N29<1,3, IF(AND(N29>=10,N29<=20),4, IF(N29<=1000,3,4) )),\"\")","v":""}]
[null,{"$f":"IF(ISNUMBER(D178),CONCATENATE(ZaokrText(N26,O26),\" ms\"),\"\")","v":""},null,null,null,null,null,null,{"$f":"IF(G184=\"\",\"\",IF(F182<=0, \"\", IF($J182<0,CONCATENATE(ZaokrText(G184,$Q$10),\" mm\"), CHOOSE(LJazyk,\"celé okno\",  \"full open\"))))","v":""},{"$f":"IF(I184=\"\",\"\",IF(G182<=0, \"\", IF($J182<0,CONCATENATE(ZaokrText(I184,$Q$10),\" mm\"), CHOOSE(LJazyk,\"celé okno\",  \"full open\"))))","v":""},{"$f":"IF(K184=\"\",\"\",IF(H182<=0, \"\", IF($J182<0,CONCATENATE(ZaokrText(K184,$Q$10),\" mm\"), CHOOSE(LJazyk,\"celé okno\",  \"full open\"))))","v":""},null,null,{"$f":"IF(ISNUMBER(D193),OdchZmerCasuDIN(1/J469,1,\"Min\")*1000,\"\")","v":""},{"$f":"IF(ISNUMBER(N30),IF(N30<1,2, IF(AND(N30>=10,N30<=20),4, IF(N30<=1000,3,4) )),\"\")","v":""},null,{"$f":"IF(AND(ISNUMBER(B29),ISNUMBER(J442)),J442,NA())","v":{"$error":"#N/A"}},{"$f":"IF(AND(ISNUMBER(D29),ISNUMBER(J442)),1/(F179/1000000),NA())","v":{"$error":"#N/A"}},"","",{"$f":" IF(OR((ROUND(EXP(MAX(S24:T53))-10^(INT(LOG10(EXP(MAX(S24:T53))))),7))<>0,ROUND(10^(INT(LOG10(EXP(MAX(S24:T53))))),4)=ROUND(MinimumWosy,4)), IF(COUNT(S24:S53)>0,10^(INT(LOG10(EXP(MAX(S24:T53))))+1),100),IF(COUNT(S24:S53)>0,10^(INT(LOG10(EXP(MAX(S24:T53))))),100))","v":100},{"$f":" IF(OR((ROUND(EXP(MAX(S24:T53))-10^(INT(LOG10(EXP(MAX(S24:T53))))),7))<>0,ROUND(10^(INT(LOG10(EXP(MAX(S24:T53))))),4)=ROUND(V28,4)), IF(COUNT(T24:T53)>0,10^(INT(LOG10(EXP(MAX(S24:T53))))+1),100),IF(COUNT(T24:T53)>0,10^(INT(LOG10(EXP(MAX(S24:T53))))),100))","v":100},null,null,null,{"$f":"IF(COUNT($AA$21:$AA$22)=2,EXP(LN($AA$21)+(ROW(Z30)-ROW($Z$24))*(LN($AA$22)-LN($AA$21))/(ROWS($Z$24:$Z$59)-1)),NA())","v":{"$error":"#N/A"}},{"$f":"IF(NOT(ISNUMBER($AA$20)),NA(),IF($AA$20>1,     EXP(N(Polynom($S$24:$T$53,$AA$20,TRUE,\"K\",0))+N(Polynom($S$24:$T$53,$AA$20,TRUE,\"K\",1))*LN(Z30)+N(Polynom($S$24:$T$53,$AA$20,TRUE,\"K\",2))*LN(Z30)^2+N(Polynom($S$24:$T$53,$AA$20,TRUE,\"K\",3))*LN(Z30)^3+N(Polynom($S$24:$T$53,$AA$20,TRUE,\"K\",4))*LN(Z30)^4+N(Polynom($S$24:$T$53,$AA$20,TRUE,\"K\",5))*LN(Z30)^5+N(Polynom($S$24:$T$53,$AA$20,TRUE,\"K\",6))*LN(Z30)^6+N(Polynom($S$24:$T$53,$AA$20,TRUE,\"K\",7))*LN(Z30)^7+N(Polynom($S$24:$T$53,$AA$20,TRUE,\"K\",8))*LN(Z30)^8+N(Polynom($S$24:$T$53,$AA$20,TRUE,\"K\",9))*LN(Z30)^9+N(Polynom($S$24:$T$53,$AA$20,TRUE,\"K\",10))*LN(Z30)^10),NA()))","v":{"$error":"#N/A"}},{"$error":"#N/A"}]
[null,null,null,null,null,null,null,{"$f":"IF(ISNUMBER(H180),H180,\"\")","v":""},null,null,null,null,null,{"$f":"IF(ISNUMBER(D193),OdchZmerCasuDIN(1/J469,1,\"Max\")*1000,\"\")","v":""},{"$f":"IF(ISNUMBER(N31),IF(N31<1,2, IF(AND(N31>=10,N31<=20),4, IF(N31<=1000,3,4) )),\"\")","v":""}]
[null,{"$f":"IF(ISNUMBER(D178),CONCATENATE(ZaokrText(N27,O27),\" ms - \",ZaokrText(N28,O28),\" ms\"),\"\")","v":""},null,{"$f":"IF(ISNUMBER(F179),F179/1000,\"\")","v":""},null,null,null,null,{"$f":"IF(G184=\"\",\"\",IF($J182<0,CONCATENATE(ZaokrText(G184/(F182*0.001),$Q$10),\" m/s\"),\"\"))","v":""},{"$f":"IF(I184=\"\",\"\",IF($J182<0,CONCATENATE(ZaokrText(I184/(G182*0.001),$Q$10),\" m/s\"),\"\"))","v":""},{"$f":"IF(K184=\"\",\"\",IF($J182<0,CONCATENATE(ZaokrText(K184/(H182*0.001),$Q$10),\" m/s\"),\"\"))","v":""},null,null,{"$f":"IF(ISNUMBER(D208),OdchZmerCasuDIN(1/J496,1,\"Sol\")*1000,\"\")","v":""},{"$f":"IF(ISNUMBER(N32),IF(N32<1,3, IF(AND(N32>=10,N32<=20),4, IF(N32<=1000,3,4) )),\"\")","v":""},null,{"$f":"IF(AND(ISNUMBER(B33),ISNUMBER(J469)),J469,NA())","v":{"$error":"#N/A"}},{"$f":"IF(AND(ISNUMBER(D33),ISNUMBER(J469)),1/(F194/1000000),NA())","v":{"$error":"#N/A"}},"","",{"$f":"CHOOSE(LJazyk,\"Linregrese pro logaritmicky transformovaná datata (jen konstanty) y = m*x + b:\",  \"Linear regression for logarithmically transformed data (constants only) y = m*x + b:\")","v":"Linear regression for logarithmically transformed data (constants only) y = m*x + b:"},null,null,null,null,{"$f":"IF(COUNT($AA$21:$AA$22)=2,EXP(LN($AA$21)+(ROW(Z32)-ROW($Z$24))*(LN($AA$22)-LN($AA$21))/(ROWS($Z$24:$Z$59)-1)),NA())","v":{"$error":"#N/A"}},{"$f":"IF(NOT(ISNUMBER($AA$20)),NA(),IF($AA$20>1,     EXP(N(Polynom($S$24:$T$53,$AA$20,TRUE,\"K\",0))+N(Polynom($S$24:$T$53,$AA$20,TRUE,\"K\",1))*LN(Z32)+N(Polynom($S$24:$T$53,$AA$20,TRUE,\"K\",2))*LN(Z32)^2+N(Polynom($S$24:$T$53,$AA$20,TRUE,\"K\",3))*LN(Z32)^3+N(Polynom($S$24:$T$53,$AA$20,TRUE,\"K\",4))*LN(Z32)^4+N(Polynom($S$24:$T$53,$AA$20,TRUE,\"K\",5))*LN(Z32)^5+N(Polynom($S$24:$T$53,$AA$20,TRUE,\"K\",6))*LN(Z32)^6+N(Polynom($S$24:$T$53,$AA$20,TRUE,\"K\",7))*LN(Z32)^7+N(Polynom($S$24:$T$53,$AA$20,TRUE,\"K\",8))*LN(Z32)^8+N(Polynom($S$24:$T$53,$AA$20,TRUE,\"K\",9))*LN(Z32)^9+N(Polynom($S$24:$T$53,$AA$20,TRUE,\"K\",10))*LN(Z32)^10),NA()))","v":{"$error":"#N/A"}},{"$error":"#N/A"}]
[5,{"$f":"IF(ISNUMBER(D193),D193,\"\")","v":""},null,{"$f":"IF(ISNUMBER(F194),IF(F194/1000000>=1,F194/1000000,1/(F194/1000000)),\"\")","v":""},null,{"$f":"IF(ISNUMBER(G201),G201,\"\")","v":""},{"$f":"IF(ISNUMBER(J201),J201,\"\")","v":""},{"$f":"IF(ISNUMBER(G195),G195,\"\")","v":""},{"$f":"IF(ISNUMBER(F197),IF(F197<=0, CHOOSE(LJazyk,\"Zavřeno!!\",  \"Closed!!\"),  CONCATENATE(ZaokrText(IF(F197>=1000000,F197/1000000,F197/1000),$Q$10),IF(F197/1000000>=1,\" s\",\" ms\"))),\"\")","v":""},{"$f":"IF(ISNUMBER(G197),IF(G197<=0, CHOOSE(LJazyk,\"Zavřeno!!\",  \"Closed!!\"),  CONCATENATE(ZaokrText(IF(G197>=1000000,G197/1000000,G197/1000),$Q$10),IF(G197/1000000>=1,\" s\",\" ms\"))),\"\")","v":""},{"$f":"IF(ISNUMBER(H197),IF(H197<=0, CHOOSE(LJazyk,\"Zavřeno!!\",  \"Closed!!\"),  CONCATENATE(ZaokrText(IF(H197>=1000000,H197/1000000,H197/1000),$Q$10),IF(H197/1000000>=1,\" s\",\" ms\"))),\"\")","v":""},{"$f":"IF(COUNT(F197:H197)>=3, IF( MIN(F197:H197)<=0,CHOOSE(LJazyk,\"Nelze\",  \"Can not\"), MAX(F197:H197)/MIN(F197:H197)),\"\")","v":""},null,{"$f":"IF(ISNUMBER(D208),OdchZmerCasuDIN(1/J496,1,\"Min\")*1000,\"\")","v":""},{"$f":"IF(ISNUMBER(N33),IF(N33<1,2, IF(AND(N33>=10,N33<=20),4, IF(N33<=1000,3,4) )),\"\")","v":""}]
[null,{"$f":"IF(ISNUMBER(D193),CONCATENATE(ZaokrText(N29,O29),\" ms\"),\"\")","v":""},null,null,null,null,null,null,{"$f":"IF(G199=\"\",\"\",IF(F197<=0, \"\", IF($J197<0,CONCATENATE(ZaokrText(G199,$Q$10),\" mm\"), CHOOSE(LJazyk,\"celé okno\",  \"full open\"))))","v":""},{"$f":"IF(I199=\"\",\"\",IF(G197<=0, \"\", IF($J197<0,CONCATENATE(ZaokrText(I199,$Q$10),\" mm\"), CHOOSE(LJazyk,\"celé okno\",  \"full open\"))))","v":""},{"$f":"IF(K199=\"\",\"\",IF(H197<=0, \"\", IF($J197<0,CONCATENATE(ZaokrText(K199,$Q$10),\" mm\"), CHOOSE(LJazyk,\"celé okno\",  \"full open\"))))","v":""},null,null,{"$f":"IF(ISNUMBER(D208),OdchZmerCasuDIN(1/J496,1,\"Max\")*1000,\"\")","v":""},{"$f":"IF(ISNUMBER(N34),IF(N34<1,2, IF(AND(N34>=10,N34<=20),4, IF(N34<=1000,3,4) )),\"\")","v":""},null,{"$f":"IF(AND(ISNUMBER(B37),ISNUMBER(J496)),J496,NA())","v":{"$error":"#N/A"}},{"$f":"IF(AND(ISNUMBER(D37),ISNUMBER(J496)),1/(F209/1000000),NA())","v":{"$error":"#N/A"}},"","","m","b",null,null,null,{"$f":"IF(COUNT($AA$21:$AA$22)=2,EXP(LN($AA$21)+(ROW(Z34)-ROW($Z$24))*(LN($AA$22)-LN($AA$21))/(ROWS($Z$24:$Z$59)-1)),NA())","v":{"$error":"#N/A"}},{"$f":"IF(NOT(ISNUMBER($AA$20)),NA(),IF($AA$20>1,     EXP(N(Polynom($S$24:$T$53,$AA$20,TRUE,\"K\",0))+N(Polynom($S$24:$T$53,$AA$20,TRUE,\"K\",1))*LN(Z34)+N(Polynom($S$24:$T$53,$AA$20,TRUE,\"K\",2))*LN(Z34)^2+N(Polynom($S$24:$T$53,$AA$20,TRUE,\"K\",3))*LN(Z34)^3+N(Polynom($S$24:$T$53,$AA$20,TRUE,\"K\",4))*LN(Z34)^4+N(Polynom($S$24:$T$53,$AA$20,TRUE,\"K\",5))*LN(Z34)^5+N(Polynom($S$24:$T$53,$AA$20,TRUE,\"K\",6))*LN(Z34)^6+N(Polynom($S$24:$T$53,$AA$20,TRUE,\"K\",7))*LN(Z34)^7+N(Polynom($S$24:$T$53,$AA$20,TRUE,\"K\",8))*LN(Z34)^8+N(Polynom($S$24:$T$53,$AA$20,TRUE,\"K\",9))*LN(Z34)^9+N(Polynom($S$24:$T$53,$AA$20,TRUE,\"K\",10))*LN(Z34)^10),NA()))","v":{"$error":"#N/A"}},{"$error":"#N/A"}]
[null,null,null,null,null,null,null,{"$f":"IF(ISNUMBER(H195),H195,\"\")","v":""},null,null,null,null,null,{"$f":"IF(ISNUMBER(D223),OdchZmerCasuDIN(1/J523,1,\"Sol\")*1000,\"\")","v":""},{"$f":"IF(ISNUMBER(N35),IF(N35<1,3, IF(AND(N35>=10,N35<=20),4, IF(N35<=1000,3,4) )),\"\")","v":""}]
[null,{"$f":"IF(ISNUMBER(D193),CONCATENATE(ZaokrText(N30,O30),\" ms - \",ZaokrText(N31,O31),\" ms\"),\"\")","v":""},null,{"$f":"IF(ISNUMBER(F194),F194/1000,\"\")","v":""},null,null,null,null,{"$f":"IF(G199=\"\",\"\",IF($J197<0,CONCATENATE(ZaokrText(G199/(F197*0.001),$Q$10),\" m/s\"),\"\"))","v":""},{"$f":"IF(I199=\"\",\"\",IF($J197<0,CONCATENATE(ZaokrText(I199/(G197*0.001),$Q$10),\" m/s\"),\"\"))","v":""},{"$f":"IF(K199=\"\",\"\",IF($J197<0,CONCATENATE(ZaokrText(K199/(H197*0.001),$Q$10),\" m/s\"),\"\"))","v":""},null,null,{"$f":"IF(ISNUMBER(D223),OdchZmerCasuDIN(1/J523,1,\"Min\")*1000,\"\")","v":""},{"$f":"IF(ISNUMBER(N36),IF(N36<1,2, IF(AND(N36>=10,N36<=20),4, IF(N36<=1000,3,4) )),\"\")","v":""},null,{"$f":"IF(AND(ISNUMBER(B41),ISNUMBER(J523)),J523,NA())","v":{"$error":"#N/A"}},{"$f":"IF(AND(ISNUMBER(D41),ISNUMBER(J523)),1/(F224/1000000),NA())","v":{"$error":"#N/A"}},"","",{"$f":"CHOOSE(LJazyk,Polynom($S$24:$T$53,1,TRUE,\"K\",1),Polynom($S$24:$T$53,1,TRUE,\"K\",1))","v":"There's few data !"},{"$f":"CHOOSE(LJazyk,Polynom($S$24:$T$53,1,TRUE,\"K\",0),Polynom($S$24:$T$53,1,TRUE,\"K\",0))","v":"There's few data !"},{"$f":"CHOOSE(LJazyk,\"Tady je to počítáno mou fuňkcí, té vynechávky nevadí\",  \"Here calculates my function, which doesn't mind empty cells\")","v":"Here calculates my function, which doesn't mind empty cells"},null,null,{"$f":"IF(COUNT($AA$21:$AA$22)=2,EXP(LN($AA$21)+(ROW(Z36)-ROW($Z$24))*(LN($AA$22)-LN($AA$21))/(ROWS($Z$24:$Z$59)-1)),NA())","v":{"$error":"#N/A"}},{"$f":"IF(NOT(ISNUMBER($AA$20)),NA(),IF($AA$20>1,     EXP(N(Polynom($S$24:$T$53,$AA$20,TRUE,\"K\",0))+N(Polynom($S$24:$T$53,$AA$20,TRUE,\"K\",1))*LN(Z36)+N(Polynom($S$24:$T$53,$AA$20,TRUE,\"K\",2))*LN(Z36)^2+N(Polynom($S$24:$T$53,$AA$20,TRUE,\"K\",3))*LN(Z36)^3+N(Polynom($S$24:$T$53,$AA$20,TRUE,\"K\",4))*LN(Z36)^4+N(Polynom($S$24:$T$53,$AA$20,TRUE,\"K\",5))*LN(Z36)^5+N(Polynom($S$24:$T$53,$AA$20,TRUE,\"K\",6))*LN(Z36)^6+N(Polynom($S$24:$T$53,$AA$20,TRUE,\"K\",7))*LN(Z36)^7+N(Polynom($S$24:$T$53,$AA$20,TRUE,\"K\",8))*LN(Z36)^8+N(Polynom($S$24:$T$53,$AA$20,TRUE,\"K\",9))*LN(Z36)^9+N(Polynom($S$24:$T$53,$AA$20,TRUE,\"K\",10))*LN(Z36)^10),NA()))","v":{"$error":"#N/A"}},{"$error":"#N/A"}]
[6,{"$f":"IF(ISNUMBER(D208),D208,\"\")","v":""},null,{"$f":"IF(ISNUMBER(F209),IF(F209/1000000>=1,F209/1000000,1/(F209/1000000)),\"\")","v":""},null,{"$f":"IF(ISNUMBER(G216),G216,\"\")","v":""},{"$f":"IF(ISNUMBER(J216),J216,\"\")","v":""},{"$f":"IF(ISNUMBER(G210),G210,\"\")","v":""},{"$f":"IF(ISNUMBER(F212),IF(F212<=0, CHOOSE(LJazyk,\"Zavřeno!!\",  \"Closed!!\"),  CONCATENATE(ZaokrText(IF(F212>=1000000,F212/1000000,F212/1000),$Q$10),IF(F212/1000000>=1,\" s\",\" ms\"))),\"\")","v":""},{"$f":"IF(ISNUMBER(G212),IF(G212<=0, CHOOSE(LJazyk,\"Zavřeno!!\",  \"Closed!!\"),  CONCATENATE(ZaokrText(IF(G212>=1000000,G212/1000000,G212/1000),$Q$10),IF(G212/1000000>=1,\" s\",\" ms\"))),\"\")","v":""},{"$f":"IF(ISNUMBER(H212),IF(H212<=0, CHOOSE(LJazyk,\"Zavřeno!!\",  \"Closed!!\"),  CONCATENATE(ZaokrText(IF(H212>=1000000,H212/1000000,H212/1000),$Q$10),IF(H212/1000000>=1,\" s\",\" ms\"))),\"\")","v":""},{"$f":"IF(COUNT(F212:H212)>=3, IF( MIN(F212:H212)<=0,CHOOSE(LJazyk,\"Nelze\",  \"Can not\"), MAX(F212:H212)/MIN(F212:H212)),\"\")","v":""},null,{"$f":"IF(ISNUMBER(D223),OdchZmerCasuDIN(1/J523,1,\"Max\")*1000,\"\")","v":""},{"$f":"IF(ISNUMBER(N37),IF(N37<1,2, IF(AND(N37>=10,N37<=20),4, IF(N37<=1000,3,4) )),\"\")","v":""}]
[null,{"$f":"IF(ISNUMBER(D208),CONCATENATE(ZaokrText(N32,O32),\" ms\"),\"\")","v":""},null,null,null,null,null,null,{"$f":"IF(G214=\"\",\"\",IF(F212<=0, \"\", IF($J212<0,CONCATENATE(ZaokrText(G214,$Q$10),\" mm\"), CHOOSE(LJazyk,\"celé okno\",  \"full open\"))))","v":""},{"$f":"IF(I214=\"\",\"\",IF(G212<=0, \"\", IF($J212<0,CONCATENATE(ZaokrText(I214,$Q$10),\" mm\"), CHOOSE(LJazyk,\"celé okno\",  \"full open\"))))","v":""},{"$f":"IF(K214=\"\",\"\",IF(H212<=0, \"\", IF($J212<0,CONCATENATE(ZaokrText(K214,$Q$10),\" mm\"), CHOOSE(LJazyk,\"celé okno\",  \"full open\"))))","v":""},null,null,{"$f":"IF(ISNUMBER(D238),OdchZmerCasuDIN(1/J550,1,\"Sol\")*1000,\"\")","v":""},{"$f":"IF(ISNUMBER(N38),IF(N38<1,3, IF(AND(N38>=10,N38<=20),4, IF(N38<=1000,3,4) )),\"\")","v":""},null,{"$f":"IF(AND(ISNUMBER(B45),ISNUMBER(J550)),J550,NA())","v":{"$error":"#N/A"}},{"$f":"IF(AND(ISNUMBER(D45),ISNUMBER(J550)),1/(F239/1000000),NA())","v":{"$error":"#N/A"}},"","",{"$f":"CHOOSE(LJazyk,\"a převedená rovnice na tvar y = a * x^(b) pro původní data (mocninný proklad):\",  \"and transformed equation to form y = a * x^(b) for original data\")","v":"and transformed equation to form y = a * x^(b) for original data"},null,null,null,null,{"$f":"IF(COUNT($AA$21:$AA$22)=2,EXP(LN($AA$21)+(ROW(Z38)-ROW($Z$24))*(LN($AA$22)-LN($AA$21))/(ROWS($Z$24:$Z$59)-1)),NA())","v":{"$error":"#N/A"}},{"$f":"IF(NOT(ISNUMBER($AA$20)),NA(),IF($AA$20>1,     EXP(N(Polynom($S$24:$T$53,$AA$20,TRUE,\"K\",0))+N(Polynom($S$24:$T$53,$AA$20,TRUE,\"K\",1))*LN(Z38)+N(Polynom($S$24:$T$53,$AA$20,TRUE,\"K\",2))*LN(Z38)^2+N(Polynom($S$24:$T$53,$AA$20,TRUE,\"K\",3))*LN(Z38)^3+N(Polynom($S$24:$T$53,$AA$20,TRUE,\"K\",4))*LN(Z38)^4+N(Polynom($S$24:$T$53,$AA$20,TRUE,\"K\",5))*LN(Z38)^5+N(Polynom($S$24:$T$53,$AA$20,TRUE,\"K\",6))*LN(Z38)^6+N(Polynom($S$24:$T$53,$AA$20,TRUE,\"K\",7))*LN(Z38)^7+N(Polynom($S$24:$T$53,$AA$20,TRUE,\"K\",8))*LN(Z38)^8+N(Polynom($S$24:$T$53,$AA$20,TRUE,\"K\",9))*LN(Z38)^9+N(Polynom($S$24:$T$53,$AA$20,TRUE,\"K\",10))*LN(Z38)^10),NA()))","v":{"$error":"#N/A"}},{"$error":"#N/A"}]
[null,null,null,null,null,null,null,{"$f":"IF(ISNUMBER(H210),H210,\"\")","v":""},null,null,null,null,null,{"$f":"IF(ISNUMBER(D238),OdchZmerCasuDIN(1/J550,1,\"Min\")*1000,\"\")","v":""},{"$f":"IF(ISNUMBER(N39),IF(N39<1,2, IF(AND(N39>=10,N39<=20),4, IF(N39<=1000,3,4) )),\"\")","v":""}]
[null,{"$f":"IF(ISNUMBER(D208),CONCATENATE(ZaokrText(N33,O33),\" ms - \",ZaokrText(N34,O34),\" ms\"),\"\")","v":""},null,{"$f":"IF(ISNUMBER(F209),F209/1000,\"\")","v":""},null,null,null,null,{"$f":"IF(G214=\"\",\"\",IF($J212<0,CONCATENATE(ZaokrText(G214/(F212*0.001),$Q$10),\" m/s\"),\"\"))","v":""},{"$f":"IF(I214=\"\",\"\",IF($J212<0,CONCATENATE(ZaokrText(I214/(G212*0.001),$Q$10),\" m/s\"),\"\"))","v":""},{"$f":"IF(K214=\"\",\"\",IF($J212<0,CONCATENATE(ZaokrText(K214/(H212*0.001),$Q$10),\" m/s\"),\"\"))","v":""},null,null,{"$f":"IF(ISNUMBER(D238),OdchZmerCasuDIN(1/J550,1,\"Max\")*1000,\"\")","v":""},{"$f":"IF(ISNUMBER(N40),IF(N40<1,2, IF(AND(N40>=10,N40<=20),4, IF(N40<=1000,3,4) )),\"\")","v":""},null,{"$f":"IF(AND(ISNUMBER(B49),ISNUMBER(J577)),J577,NA())","v":{"$error":"#N/A"}},{"$f":"IF(AND(ISNUMBER(D49),ISNUMBER(J577)),1/(F254/1000000),NA())","v":{"$error":"#N/A"}},"","","a","b",null,null,null,{"$f":"IF(COUNT($AA$21:$AA$22)=2,EXP(LN($AA$21)+(ROW(Z40)-ROW($Z$24))*(LN($AA$22)-LN($AA$21))/(ROWS($Z$24:$Z$59)-1)),NA())","v":{"$error":"#N/A"}},{"$f":"IF(NOT(ISNUMBER($AA$20)),NA(),IF($AA$20>1,     EXP(N(Polynom($S$24:$T$53,$AA$20,TRUE,\"K\",0))+N(Polynom($S$24:$T$53,$AA$20,TRUE,\"K\",1))*LN(Z40)+N(Polynom($S$24:$T$53,$AA$20,TRUE,\"K\",2))*LN(Z40)^2+N(Polynom($S$24:$T$53,$AA$20,TRUE,\"K\",3))*LN(Z40)^3+N(Polynom($S$24:$T$53,$AA$20,TRUE,\"K\",4))*LN(Z40)^4+N(Polynom($S$24:$T$53,$AA$20,TRUE,\"K\",5))*LN(Z40)^5+N(Polynom($S$24:$T$53,$AA$20,TRUE,\"K\",6))*LN(Z40)^6+N(Polynom($S$24:$T$53,$AA$20,TRUE,\"K\",7))*LN(Z40)^7+N(Polynom($S$24:$T$53,$AA$20,TRUE,\"K\",8))*LN(Z40)^8+N(Polynom($S$24:$T$53,$AA$20,TRUE,\"K\",9))*LN(Z40)^9+N(Polynom($S$24:$T$53,$AA$20,TRUE,\"K\",10))*LN(Z40)^10),NA()))","v":{"$error":"#N/A"}},{"$error":"#N/A"}]
[7,{"$f":"IF(ISNUMBER(D223),D223,\"\")","v":""},null,{"$f":"IF(ISNUMBER(F224),IF(F224/1000000>=1,F224/1000000,1/(F224/1000000)),\"\")","v":""},null,{"$f":"IF(ISNUMBER(G231),G231,\"\")","v":""},{"$f":"IF(ISNUMBER(J231),J231,\"\")","v":""},{"$f":"IF(ISNUMBER(G225),G225,\"\")","v":""},{"$f":"IF(ISNUMBER(F227),IF(F227<=0, CHOOSE(LJazyk,\"Zavřeno!!\",  \"Closed!!\"),  CONCATENATE(ZaokrText(IF(F227>=1000000,F227/1000000,F227/1000),$Q$10),IF(F227/1000000>=1,\" s\",\" ms\"))),\"\")","v":""},{"$f":"IF(ISNUMBER(G227),IF(G227<=0, CHOOSE(LJazyk,\"Zavřeno!!\",  \"Closed!!\"),  CONCATENATE(ZaokrText(IF(G227>=1000000,G227/1000000,G227/1000),$Q$10),IF(G227/1000000>=1,\" s\",\" ms\"))),\"\")","v":""},{"$f":"IF(ISNUMBER(H227),IF(H227<=0, CHOOSE(LJazyk,\"Zavřeno!!\",  \"Closed!!\"),  CONCATENATE(ZaokrText(IF(H227>=1000000,H227/1000000,H227/1000),$Q$10),IF(H227/1000000>=1,\" s\",\" ms\"))),\"\")","v":""},{"$f":"IF(COUNT(F227:H227)>=3, IF( MIN(F227:H227)<=0,CHOOSE(LJazyk,\"Nelze\",  \"Can not\"), MAX(F227:H227)/MIN(F227:H227)),\"\")","v":""},null,{"$f":"IF(ISNUMBER(D253),OdchZmerCasuDIN(1/J577,1,\"Sol\")*1000,\"\")","v":""},{"$f":"IF(ISNUMBER(N41),IF(N41<1,3, IF(AND(N41>=10,N41<=20),4, IF(N41<=1000,3,4) )),\"\")","v":""}]
[null,{"$f":"IF(ISNUMBER(D223),CONCATENATE(ZaokrText(N35,O35),\" ms\"),\"\")","v":""},null,null,null,null,null,null,{"$f":"IF(G229=\"\",\"\",IF(F227<=0, \"\", IF($J227<0,CONCATENATE(ZaokrText(G229,$Q$10),\" mm\"), CHOOSE(LJazyk,\"celé okno\",  \"full open\"))))","v":""},{"$f":"IF(I229=\"\",\"\",IF(G227<=0, \"\", IF($J227<0,CONCATENATE(ZaokrText(I229,$Q$10),\" mm\"), CHOOSE(LJazyk,\"celé okno\",  \"full open\"))))","v":""},{"$f":"IF(K229=\"\",\"\",IF(H227<=0, \"\", IF($J227<0,CONCATENATE(ZaokrText(K229,$Q$10),\" mm\"), CHOOSE(LJazyk,\"celé okno\",  \"full open\"))))","v":""},null,null,{"$f":"IF(ISNUMBER(D253),OdchZmerCasuDIN(1/J577,1,\"Min\")*1000,\"\")","v":""},{"$f":"IF(ISNUMBER(N42),IF(N42<1,2, IF(AND(N42>=10,N42<=20),4, IF(N42<=1000,3,4) )),\"\")","v":""},null,{"$f":"IF(AND(ISNUMBER(B53),ISNUMBER(J604)),J604,NA())","v":{"$error":"#N/A"}},{"$f":"IF(AND(ISNUMBER(D53),ISNUMBER(J604)),1/(F269/1000000),NA())","v":{"$error":"#N/A"}},"","",{"$f":"IF(ISNUMBER(V36),EXP(V36),NA())","v":{"$error":"#N/A"}},{"$f":"IF(ISNUMBER(U36),U36,NA())","v":{"$error":"#N/A"}},null,null,null,{"$f":"IF(COUNT($AA$21:$AA$22)=2,EXP(LN($AA$21)+(ROW(Z42)-ROW($Z$24))*(LN($AA$22)-LN($AA$21))/(ROWS($Z$24:$Z$59)-1)),NA())","v":{"$error":"#N/A"}},{"$f":"IF(NOT(ISNUMBER($AA$20)),NA(),IF($AA$20>1,     EXP(N(Polynom($S$24:$T$53,$AA$20,TRUE,\"K\",0))+N(Polynom($S$24:$T$53,$AA$20,TRUE,\"K\",1))*LN(Z42)+N(Polynom($S$24:$T$53,$AA$20,TRUE,\"K\",2))*LN(Z42)^2+N(Polynom($S$24:$T$53,$AA$20,TRUE,\"K\",3))*LN(Z42)^3+N(Polynom($S$24:$T$53,$AA$20,TRUE,\"K\",4))*LN(Z42)^4+N(Polynom($S$24:$T$53,$AA$20,TRUE,\"K\",5))*LN(Z42)^5+N(Polynom($S$24:$T$53,$AA$20,TRUE,\"K\",6))*LN(Z42)^6+N(Polynom($S$24:$T$53,$AA$20,TRUE,\"K\",7))*LN(Z42)^7+N(Polynom($S$24:$T$53,$AA$20,TRUE,\"K\",8))*LN(Z42)^8+N(Polynom($S$24:$T$53,$AA$20,TRUE,\"K\",9))*LN(Z42)^9+N(Polynom($S$24:$T$53,$AA$20,TRUE,\"K\",10))*LN(Z42)^10),NA()))","v":{"$error":"#N/A"}},{"$error":"#N/A"}]
[null,null,null,null,null,null,null,{"$f":"IF(ISNUMBER(H225),H225,\"\")","v":""},null,null,null,null,null,{"$f":"IF(ISNUMBER(D253),OdchZmerCasuDIN(1/J577,1,\"Max\")*1000,\"\")","v":""},{"$f":"IF(ISNUMBER(N43),IF(N43<1,2, IF(AND(N43>=10,N43<=20),4, IF(N43<=1000,3,4) )),\"\")","v":""}]
[null,{"$f":"IF(ISNUMBER(D223),CONCATENATE(ZaokrText(N36,O36),\" ms - \",ZaokrText(N37,O37),\" ms\"),\"\")","v":""},null,{"$f":"IF(ISNUMBER(F224),F224/1000,\"\")","v":""},null,null,null,null,{"$f":"IF(G229=\"\",\"\",IF($J227<0,CONCATENATE(ZaokrText(G229/(F227*0.001),$Q$10),\" m/s\"),\"\"))","v":""},{"$f":"IF(I229=\"\",\"\",IF($J227<0,CONCATENATE(ZaokrText(I229/(G227*0.001),$Q$10),\" m/s\"),\"\"))","v":""},{"$f":"IF(K229=\"\",\"\",IF($J227<0,CONCATENATE(ZaokrText(K229/(H227*0.001),$Q$10),\" m/s\"),\"\"))","v":""},null,null,{"$f":"IF(ISNUMBER(D268),OdchZmerCasuDIN(1/J604,1,\"Sol\")*1000,\"\")","v":""},{"$f":"IF(ISNUMBER(N44),IF(N44<1,3, IF(AND(N44>=10,N44<=20),4, IF(N44<=1000,3,4) )),\"\")","v":""},null,{"$f":"IF(AND(ISNUMBER(B57),ISNUMBER(J631)),J631,NA())","v":{"$error":"#N/A"}},{"$f":"IF(AND(ISNUMBER(D57),ISNUMBER(J631)),1/(F284/1000000),NA())","v":{"$error":"#N/A"}},"","",null,null,null,null,null,{"$f":"IF(COUNT($AA$21:$AA$22)=2,EXP(LN($AA$21)+(ROW(Z44)-ROW($Z$24))*(LN($AA$22)-LN($AA$21))/(ROWS($Z$24:$Z$59)-1)),NA())","v":{"$error":"#N/A"}},{"$f":"IF(NOT(ISNUMBER($AA$20)),NA(),IF($AA$20>1,     EXP(N(Polynom($S$24:$T$53,$AA$20,TRUE,\"K\",0))+N(Polynom($S$24:$T$53,$AA$20,TRUE,\"K\",1))*LN(Z44)+N(Polynom($S$24:$T$53,$AA$20,TRUE,\"K\",2))*LN(Z44)^2+N(Polynom($S$24:$T$53,$AA$20,TRUE,\"K\",3))*LN(Z44)^3+N(Polynom($S$24:$T$53,$AA$20,TRUE,\"K\",4))*LN(Z44)^4+N(Polynom($S$24:$T$53,$AA$20,TRUE,\"K\",5))*LN(Z44)^5+N(Polynom($S$24:$T$53,$AA$20,TRUE,\"K\",6))*LN(Z44)^6+N(Polynom($S$24:$T$53,$AA$20,TRUE,\"K\",7))*LN(Z44)^7+N(Polynom($S$24:$T$53,$AA$20,TRUE,\"K\",8))*LN(Z44)^8+N(Polynom($S$24:$T$53,$AA$20,TRUE,\"K\",9))*LN(Z44)^9+N(Polynom($S$24:$T$53,$AA$20,TRUE,\"K\",10))*LN(Z44)^10),NA()))","v":{"$error":"#N/A"}},{"$error":"#N/A"}]
[8,{"$f":"IF(ISNUMBER(D238),D238,\"\")","v":""},null,{"$f":"IF(ISNUMBER(F239),IF(F239/1000000>=1,F239/1000000,1/(F239/1000000)),\"\")","v":""},null,{"$f":"IF(ISNUMBER(G246),G246,\"\")","v":""},{"$f":"IF(ISNUMBER(J246),J246,\"\")","v":""},{"$f":"IF(ISNUMBER(G240),G240,\"\")","v":""},{"$f":"IF(ISNUMBER(F242),IF(F242<=0, CHOOSE(LJazyk,\"Zavřeno!!\",  \"Closed!!\"),  CONCATENATE(ZaokrText(IF(F242>=1000000,F242/1000000,F242/1000),$Q$10),IF(F242/1000000>=1,\" s\",\" ms\"))),\"\")","v":""},{"$f":"IF(ISNUMBER(G242),IF(G242<=0, CHOOSE(LJazyk,\"Zavřeno!!\",  \"Closed!!\"),  CONCATENATE(ZaokrText(IF(G242>=1000000,G242/1000000,G242/1000),$Q$10),IF(G242/1000000>=1,\" s\",\" ms\"))),\"\")","v":""},{"$f":"IF(ISNUMBER(H242),IF(H242<=0, CHOOSE(LJazyk,\"Zavřeno!!\",  \"Closed!!\"),  CONCATENATE(ZaokrText(IF(H242>=1000000,H242/1000000,H242/1000),$Q$10),IF(H242/1000000>=1,\" s\",\" ms\"))),\"\")","v":""},{"$f":"IF(COUNT(F242:H242)>=3, IF( MIN(F242:H242)<=0,CHOOSE(LJazyk,\"Nelze\",  \"Can not\"), MAX(F242:H242)/MIN(F242:H242)),\"\")","v":""},null,{"$f":"IF(ISNUMBER(D268),OdchZmerCasuDIN(1/J604,1,\"Min\")*1000,\"\")","v":""},{"$f":"IF(ISNUMBER(N45),IF(N45<1,2, IF(AND(N45>=10,N45<=20),4, IF(N45<=1000,3,4) )),\"\")","v":""},null,null,null,null,null,{"$f":"CHOOSE(LJazyk,\"podklad pro převod je tady (od pana Zajonce):\",  \"documentation for transformation is here (from Mr Zaiontz):\")","v":"documentation for transformation is here (from Mr Zaiontz):"}]
[null,{"$f":"IF(ISNUMBER(D238),CONCATENATE(ZaokrText(N38,O38),\" ms\"),\"\")","v":""},null,null,null,null,null,null,{"$f":"IF(G244=\"\",\"\",IF(F242<=0, \"\", IF($J242<0,CONCATENATE(ZaokrText(G244,$Q$10),\" mm\"), CHOOSE(LJazyk,\"celé okno\",  \"full open\"))))","v":""},{"$f":"IF(I244=\"\",\"\",IF(G242<=0, \"\", IF($J242<0,CONCATENATE(ZaokrText(I244,$Q$10),\" mm\"), CHOOSE(LJazyk,\"celé okno\",  \"full open\"))))","v":""},{"$f":"IF(K244=\"\",\"\",IF(H242<=0, \"\", IF($J242<0,CONCATENATE(ZaokrText(K244,$Q$10),\" mm\"), CHOOSE(LJazyk,\"celé okno\",  \"full open\"))))","v":""},null,null,{"$f":"IF(ISNUMBER(D268),OdchZmerCasuDIN(1/J604,1,\"Max\")*1000,\"\")","v":""},{"$f":"IF(ISNUMBER(N46),IF(N46<1,2, IF(AND(N46>=10,N46<=20),4, IF(N46<=1000,3,4) )),\"\")","v":""},null,{"$f":"IF(AND(ISNUMBER(B61),ISNUMBER(J658)),J658,NA())","v":{"$error":"#N/A"}},{"$f":"IF(AND(ISNUMBER(D61),ISNUMBER(J658)),1/(F299/1000000),NA())","v":{"$error":"#N/A"}},"","",null,null,null,null,null,{"$f":"IF(COUNT($AA$21:$AA$22)=2,EXP(LN($AA$21)+(ROW(Z46)-ROW($Z$24))*(LN($AA$22)-LN($AA$21))/(ROWS($Z$24:$Z$59)-1)),NA())","v":{"$error":"#N/A"}},{"$f":"IF(NOT(ISNUMBER($AA$20)),NA(),IF($AA$20>1,     EXP(N(Polynom($S$24:$T$53,$AA$20,TRUE,\"K\",0))+N(Polynom($S$24:$T$53,$AA$20,TRUE,\"K\",1))*LN(Z46)+N(Polynom($S$24:$T$53,$AA$20,TRUE,\"K\",2))*LN(Z46)^2+N(Polynom($S$24:$T$53,$AA$20,TRUE,\"K\",3))*LN(Z46)^3+N(Polynom($S$24:$T$53,$AA$20,TRUE,\"K\",4))*LN(Z46)^4+N(Polynom($S$24:$T$53,$AA$20,TRUE,\"K\",5))*LN(Z46)^5+N(Polynom($S$24:$T$53,$AA$20,TRUE,\"K\",6))*LN(Z46)^6+N(Polynom($S$24:$T$53,$AA$20,TRUE,\"K\",7))*LN(Z46)^7+N(Polynom($S$24:$T$53,$AA$20,TRUE,\"K\",8))*LN(Z46)^8+N(Polynom($S$24:$T$53,$AA$20,TRUE,\"K\",9))*LN(Z46)^9+N(Polynom($S$24:$T$53,$AA$20,TRUE,\"K\",10))*LN(Z46)^10),NA()))","v":{"$error":"#N/A"}},{"$error":"#N/A"}]
[null,null,null,null,null,null,null,{"$f":"IF(ISNUMBER(H240),H240,\"\")","v":""},null,null,null,null,null,{"$f":"IF(ISNUMBER(D283),OdchZmerCasuDIN(1/J631,1,\"Sol\")*1000,\"\")","v":""},{"$f":"IF(ISNUMBER(N47),IF(N47<1,3, IF(AND(N47>=10,N47<=20),4, IF(N47<=1000,3,4) )),\"\")","v":""},null,null,null,null,null,"http://www.real-statistics.com/regression/power-regression/"]
[null,{"$f":"IF(ISNUMBER(D238),CONCATENATE(ZaokrText(N39,O39),\" ms - \",ZaokrText(N40,O40),\" ms\"),\"\")","v":""},null,{"$f":"IF(ISNUMBER(F239),F239/1000,\"\")","v":""},null,null,null,null,{"$f":"IF(G244=\"\",\"\",IF($J242<0,CONCATENATE(ZaokrText(G244/(F242*0.001),$Q$10),\" m/s\"),\"\"))","v":""},{"$f":"IF(I244=\"\",\"\",IF($J242<0,CONCATENATE(ZaokrText(I244/(G242*0.001),$Q$10),\" m/s\"),\"\"))","v":""},{"$f":"IF(K244=\"\",\"\",IF($J242<0,CONCATENATE(ZaokrText(K244/(H242*0.001),$Q$10),\" m/s\"),\"\"))","v":""},null,null,{"$f":"IF(ISNUMBER(D283),OdchZmerCasuDIN(1/J631,1,\"Min\")*1000,\"\")","v":""},{"$f":"IF(ISNUMBER(N48),IF(N48<1,2, IF(AND(N48>=10,N48<=20),4, IF(N48<=1000,3,4) )),\"\")","v":""},null,{"$f":"IF(AND(ISNUMBER(B65),ISNUMBER(J685)),J685,NA())","v":{"$error":"#N/A"}},{"$f":"IF(AND(ISNUMBER(D65),ISNUMBER(J685)),1/(F314/1000000),NA())","v":{"$error":"#N/A"}},"","",null,null,null,null,null,{"$f":"IF(COUNT($AA$21:$AA$22)=2,EXP(LN($AA$21)+(ROW(Z48)-ROW($Z$24))*(LN($AA$22)-LN($AA$21))/(ROWS($Z$24:$Z$59)-1)),NA())","v":{"$error":"#N/A"}},{"$f":"IF(NOT(ISNUMBER($AA$20)),NA(),IF($AA$20>1,     EXP(N(Polynom($S$24:$T$53,$AA$20,TRUE,\"K\",0))+N(Polynom($S$24:$T$53,$AA$20,TRUE,\"K\",1))*LN(Z48)+N(Polynom($S$24:$T$53,$AA$20,TRUE,\"K\",2))*LN(Z48)^2+N(Polynom($S$24:$T$53,$AA$20,TRUE,\"K\",3))*LN(Z48)^3+N(Polynom($S$24:$T$53,$AA$20,TRUE,\"K\",4))*LN(Z48)^4+N(Polynom($S$24:$T$53,$AA$20,TRUE,\"K\",5))*LN(Z48)^5+N(Polynom($S$24:$T$53,$AA$20,TRUE,\"K\",6))*LN(Z48)^6+N(Polynom($S$24:$T$53,$AA$20,TRUE,\"K\",7))*LN(Z48)^7+N(Polynom($S$24:$T$53,$AA$20,TRUE,\"K\",8))*LN(Z48)^8+N(Polynom($S$24:$T$53,$AA$20,TRUE,\"K\",9))*LN(Z48)^9+N(Polynom($S$24:$T$53,$AA$20,TRUE,\"K\",10))*LN(Z48)^10),NA()))","v":{"$error":"#N/A"}},{"$error":"#N/A"}]
[9,{"$f":"IF(ISNUMBER(D253),D253,\"\")","v":""},null,{"$f":"IF(ISNUMBER(F254),IF(F254/1000000>=1,F254/1000000,1/(F254/1000000)),\"\")","v":""},null,{"$f":"IF(ISNUMBER(G261),G261,\"\")","v":""},{"$f":"IF(ISNUMBER(J261),J261,\"\")","v":""},{"$f":"IF(ISNUMBER(G255),G255,\"\")","v":""},{"$f":"IF(ISNUMBER(F257),IF(F257<=0, CHOOSE(LJazyk,\"Zavřeno!!\",  \"Closed!!\"),  CONCATENATE(ZaokrText(IF(F257>=1000000,F257/1000000,F257/1000),$Q$10),IF(F257/1000000>=1,\" s\",\" ms\"))),\"\")","v":""},{"$f":"IF(ISNUMBER(G257),IF(G257<=0, CHOOSE(LJazyk,\"Zavřeno!!\",  \"Closed!!\"),  CONCATENATE(ZaokrText(IF(G257>=1000000,G257/1000000,G257/1000),$Q$10),IF(G257/1000000>=1,\" s\",\" ms\"))),\"\")","v":""},{"$f":"IF(ISNUMBER(H257),IF(H257<=0, CHOOSE(LJazyk,\"Zavřeno!!\",  \"Closed!!\"),  CONCATENATE(ZaokrText(IF(H257>=1000000,H257/1000000,H257/1000),$Q$10),IF(H257/1000000>=1,\" s\",\" ms\"))),\"\")","v":""},{"$f":"IF(COUNT(F257:H257)>=3, IF( MIN(F257:H257)<=0,CHOOSE(LJazyk,\"Nelze\",  \"Can not\"), MAX(F257:H257)/MIN(F257:H257)),\"\")","v":""},null,{"$f":"IF(ISNUMBER(D283),OdchZmerCasuDIN(1/J631,1,\"Max\")*1000,\"\")","v":""},{"$f":"IF(ISNUMBER(N49),IF(N49<1,2, IF(AND(N49>=10,N49<=20),4, IF(N49<=1000,3,4) )),\"\")","v":""}]
[null,{"$f":"IF(ISNUMBER(D253),CONCATENATE(ZaokrText(N41,O41),\" ms\"),\"\")","v":""},null,null,null,null,null,null,{"$f":"IF(G259=\"\",\"\",IF(F257<=0, \"\", IF($J257<0,CONCATENATE(ZaokrText(G259,$Q$10),\" mm\"), CHOOSE(LJazyk,\"celé okno\",  \"full open\"))))","v":""},{"$f":"IF(I259=\"\",\"\",IF(G257<=0, \"\", IF($J257<0,CONCATENATE(ZaokrText(I259,$Q$10),\" mm\"), CHOOSE(LJazyk,\"celé okno\",  \"full open\"))))","v":""},{"$f":"IF(K259=\"\",\"\",IF(H257<=0, \"\", IF($J257<0,CONCATENATE(ZaokrText(K259,$Q$10),\" mm\"), CHOOSE(LJazyk,\"celé okno\",  \"full open\"))))","v":""},null,null,{"$f":"IF(ISNUMBER(D298),OdchZmerCasuDIN(1/J658,1,\"Sol\")*1000,\"\")","v":""},{"$f":"IF(ISNUMBER(N50),IF(N50<1,3, IF(AND(N50>=10,N50<=20),4, IF(N50<=1000,3,4) )),\"\")","v":""},null,{"$f":"IF(AND(ISNUMBER(B69),ISNUMBER(J712)),J712,NA())","v":{"$error":"#N/A"}},{"$f":"IF(AND(ISNUMBER(D69),ISNUMBER(J712)),1/(F329/1000000),NA())","v":{"$error":"#N/A"}},"","",null,null,null,null,null,{"$f":"IF(COUNT($AA$21:$AA$22)=2,EXP(LN($AA$21)+(ROW(Z50)-ROW($Z$24))*(LN($AA$22)-LN($AA$21))/(ROWS($Z$24:$Z$59)-1)),NA())","v":{"$error":"#N/A"}},{"$f":"IF(NOT(ISNUMBER($AA$20)),NA(),IF($AA$20>1,     EXP(N(Polynom($S$24:$T$53,$AA$20,TRUE,\"K\",0))+N(Polynom($S$24:$T$53,$AA$20,TRUE,\"K\",1))*LN(Z50)+N(Polynom($S$24:$T$53,$AA$20,TRUE,\"K\",2))*LN(Z50)^2+N(Polynom($S$24:$T$53,$AA$20,TRUE,\"K\",3))*LN(Z50)^3+N(Polynom($S$24:$T$53,$AA$20,TRUE,\"K\",4))*LN(Z50)^4+N(Polynom($S$24:$T$53,$AA$20,TRUE,\"K\",5))*LN(Z50)^5+N(Polynom($S$24:$T$53,$AA$20,TRUE,\"K\",6))*LN(Z50)^6+N(Polynom($S$24:$T$53,$AA$20,TRUE,\"K\",7))*LN(Z50)^7+N(Polynom($S$24:$T$53,$AA$20,TRUE,\"K\",8))*LN(Z50)^8+N(Polynom($S$24:$T$53,$AA$20,TRUE,\"K\",9))*LN(Z50)^9+N(Polynom($S$24:$T$53,$AA$20,TRUE,\"K\",10))*LN(Z50)^10),NA()))","v":{"$error":"#N/A"}},{"$error":"#N/A"}]
[null,null,null,null,null,null,null,{"$f":"IF(ISNUMBER(H255),H255,\"\")","v":""},null,null,null,null,null,{"$f":"IF(ISNUMBER(D298),OdchZmerCasuDIN(1/J658,1,\"Min\")*1000,\"\")","v":""},{"$f":"IF(ISNUMBER(N51),IF(N51<1,2, IF(AND(N51>=10,N51<=20),4, IF(N51<=1000,3,4) )),\"\")","v":""}]
[null,{"$f":"IF(ISNUMBER(D253),CONCATENATE(ZaokrText(N42,O42),\" ms - \",ZaokrText(N43,O43),\" ms\"),\"\")","v":""},null,{"$f":"IF(ISNUMBER(F254),F254/1000,\"\")","v":""},null,null,null,null,{"$f":"IF(G259=\"\",\"\",IF($J257<0,CONCATENATE(ZaokrText(G259/(F257*0.001),$Q$10),\" m/s\"),\"\"))","v":""},{"$f":"IF(I259=\"\",\"\",IF($J257<0,CONCATENATE(ZaokrText(I259/(G257*0.001),$Q$10),\" m/s\"),\"\"))","v":""},{"$f":"IF(K259=\"\",\"\",IF($J257<0,CONCATENATE(ZaokrText(K259/(H257*0.001),$Q$10),\" m/s\"),\"\"))","v":""},null,null,{"$f":"IF(ISNUMBER(D298),OdchZmerCasuDIN(1/J658,1,\"Max\")*1000,\"\")","v":""},{"$f":"IF(ISNUMBER(N52),IF(N52<1,2, IF(AND(N52>=10,N52<=20),4, IF(N52<=1000,3,4) )),\"\")","v":""},null,{"$f":"IF(AND(ISNUMBER(B73),ISNUMBER(J739)),J739,NA())","v":{"$error":"#N/A"}},{"$f":"IF(AND(ISNUMBER(D73),ISNUMBER(J739)),1/(F344/1000000),NA())","v":{"$error":"#N/A"}},"","",null,null,null,null,null,{"$f":"IF(COUNT($AA$21:$AA$22)=2,EXP(LN($AA$21)+(ROW(Z52)-ROW($Z$24))*(LN($AA$22)-LN($AA$21))/(ROWS($Z$24:$Z$59)-1)),NA())","v":{"$error":"#N/A"}},{"$f":"IF(NOT(ISNUMBER($AA$20)),NA(),IF($AA$20>1,     EXP(N(Polynom($S$24:$T$53,$AA$20,TRUE,\"K\",0))+N(Polynom($S$24:$T$53,$AA$20,TRUE,\"K\",1))*LN(Z52)+N(Polynom($S$24:$T$53,$AA$20,TRUE,\"K\",2))*LN(Z52)^2+N(Polynom($S$24:$T$53,$AA$20,TRUE,\"K\",3))*LN(Z52)^3+N(Polynom($S$24:$T$53,$AA$20,TRUE,\"K\",4))*LN(Z52)^4+N(Polynom($S$24:$T$53,$AA$20,TRUE,\"K\",5))*LN(Z52)^5+N(Polynom($S$24:$T$53,$AA$20,TRUE,\"K\",6))*LN(Z52)^6+N(Polynom($S$24:$T$53,$AA$20,TRUE,\"K\",7))*LN(Z52)^7+N(Polynom($S$24:$T$53,$AA$20,TRUE,\"K\",8))*LN(Z52)^8+N(Polynom($S$24:$T$53,$AA$20,TRUE,\"K\",9))*LN(Z52)^9+N(Polynom($S$24:$T$53,$AA$20,TRUE,\"K\",10))*LN(Z52)^10),NA()))","v":{"$error":"#N/A"}},{"$error":"#N/A"}]
[10,{"$f":"IF(ISNUMBER(D268),D268,\"\")","v":""},null,{"$f":"IF(ISNUMBER(F269),IF(F269/1000000>=1,F269/1000000,1/(F269/1000000)),\"\")","v":""},null,{"$f":"IF(ISNUMBER(G276),G276,\"\")","v":""},{"$f":"IF(ISNUMBER(J276),J276,\"\")","v":""},{"$f":"IF(ISNUMBER(G270),G270,\"\")","v":""},{"$f":"IF(ISNUMBER(F272),IF(F272<=0, CHOOSE(LJazyk,\"Zavřeno!!\",  \"Closed!!\"),  CONCATENATE(ZaokrText(IF(F272>=1000000,F272/1000000,F272/1000),$Q$10),IF(F272/1000000>=1,\" s\",\" ms\"))),\"\")","v":""},{"$f":"IF(ISNUMBER(G272),IF(G272<=0, CHOOSE(LJazyk,\"Zavřeno!!\",  \"Closed!!\"),  CONCATENATE(ZaokrText(IF(G272>=1000000,G272/1000000,G272/1000),$Q$10),IF(G272/1000000>=1,\" s\",\" ms\"))),\"\")","v":""},{"$f":"IF(ISNUMBER(H272),IF(H272<=0, CHOOSE(LJazyk,\"Zavřeno!!\",  \"Closed!!\"),  CONCATENATE(ZaokrText(IF(H272>=1000000,H272/1000000,H272/1000),$Q$10),IF(H272/1000000>=1,\" s\",\" ms\"))),\"\")","v":""},{"$f":"IF(COUNT(F272:H272)>=3, IF( MIN(F272:H272)<=0,CHOOSE(LJazyk,\"Nelze\",  \"Can not\"), MAX(F272:H272)/MIN(F272:H272)),\"\")","v":""},null,{"$f":"IF(ISNUMBER(D313),OdchZmerCasuDIN(1/J685,1,\"Sol\")*1000,\"\")","v":""},{"$f":"IF(ISNUMBER(N53),IF(N53<1,3, IF(AND(N53>=10,N53<=20),4, IF(N53<=1000,3,4) )),\"\")","v":""},null,null,null,null,null,{"$f":"CHOOSE(LJazyk,\"Poznámka - vložení maticového vzorce:\",  \"Note (for me) - inserting matrix formula:\")","v":"Note (for me) - inserting matrix formula:"}]
[null,{"$f":"IF(ISNUMBER(D268),CONCATENATE(ZaokrText(N44,O44),\" ms\"),\"\")","v":""},null,null,null,null,null,null,{"$f":"IF(G274=\"\",\"\",IF(F272<=0, \"\", IF($J272<0,CONCATENATE(ZaokrText(G274,$Q$10),\" mm\"), CHOOSE(LJazyk,\"celé okno\",  \"full open\"))))","v":""},{"$f":"IF(I274=\"\",\"\",IF(G272<=0, \"\", IF($J272<0,CONCATENATE(ZaokrText(I274,$Q$10),\" mm\"), CHOOSE(LJazyk,\"celé okno\",  \"full open\"))))","v":""},{"$f":"IF(K274=\"\",\"\",IF(H272<=0, \"\", IF($J272<0,CONCATENATE(ZaokrText(K274,$Q$10),\" mm\"), CHOOSE(LJazyk,\"celé okno\",  \"full open\"))))","v":""},null,null,{"$f":"IF(ISNUMBER(D313),OdchZmerCasuDIN(1/J685,1,\"Min\")*1000,\"\")","v":""},{"$f":"IF(ISNUMBER(N54),IF(N54<1,2, IF(AND(N54>=10,N54<=20),4, IF(N54<=1000,3,4) )),\"\")","v":""},null,null,null,null,null,{"$f":"CHOOSE(LJazyk,\"do jedné buňky se napíše vzorec normálně, vybere se maticová oblast počínaje buňkou se vzorcem\",  \"formula is written normally in one cell, matrix area is selected starting from cell with formula\")","v":"formula is written normally in one cell, matrix area is selected starting from cell with formula"},null,null,null,null,{"$f":"IF(COUNT($AA$21:$AA$22)=2,EXP(LN($AA$21)+(ROW(Z54)-ROW($Z$24))*(LN($AA$22)-LN($AA$21))/(ROWS($Z$24:$Z$59)-1)),NA())","v":{"$error":"#N/A"}},{"$f":"IF(NOT(ISNUMBER($AA$20)),NA(),IF($AA$20>1,     EXP(N(Polynom($S$24:$T$53,$AA$20,TRUE,\"K\",0))+N(Polynom($S$24:$T$53,$AA$20,TRUE,\"K\",1))*LN(Z54)+N(Polynom($S$24:$T$53,$AA$20,TRUE,\"K\",2))*LN(Z54)^2+N(Polynom($S$24:$T$53,$AA$20,TRUE,\"K\",3))*LN(Z54)^3+N(Polynom($S$24:$T$53,$AA$20,TRUE,\"K\",4))*LN(Z54)^4+N(Polynom($S$24:$T$53,$AA$20,TRUE,\"K\",5))*LN(Z54)^5+N(Polynom($S$24:$T$53,$AA$20,TRUE,\"K\",6))*LN(Z54)^6+N(Polynom($S$24:$T$53,$AA$20,TRUE,\"K\",7))*LN(Z54)^7+N(Polynom($S$24:$T$53,$AA$20,TRUE,\"K\",8))*LN(Z54)^8+N(Polynom($S$24:$T$53,$AA$20,TRUE,\"K\",9))*LN(Z54)^9+N(Polynom($S$24:$T$53,$AA$20,TRUE,\"K\",10))*LN(Z54)^10),NA()))","v":{"$error":"#N/A"}},{"$error":"#N/A"}]
[null,null,null,null,null,null,null,{"$f":"IF(ISNUMBER(H270),H270,\"\")","v":""},null,null,null,null,null,{"$f":"IF(ISNUMBER(D313),OdchZmerCasuDIN(1/J685,1,\"Max\")*1000,\"\")","v":""},{"$f":"IF(ISNUMBER(N55),IF(N55<1,2, IF(AND(N55>=10,N55<=20),4, IF(N55<=1000,3,4) )),\"\")","v":""}]
[null,{"$f":"IF(ISNUMBER(D268),CONCATENATE(ZaokrText(N45,O45),\" ms - \",ZaokrText(N46,O46),\" ms\"),\"\")","v":""},null,{"$f":"IF(ISNUMBER(F269),F269/1000,\"\")","v":""},null,null,null,null,{"$f":"IF(G274=\"\",\"\",IF($J272<0,CONCATENATE(ZaokrText(G274/(F272*0.001),$Q$10),\" m/s\"),\"\"))","v":""},{"$f":"IF(I274=\"\",\"\",IF($J272<0,CONCATENATE(ZaokrText(I274/(G272*0.001),$Q$10),\" m/s\"),\"\"))","v":""},{"$f":"IF(K274=\"\",\"\",IF($J272<0,CONCATENATE(ZaokrText(K274/(H272*0.001),$Q$10),\" m/s\"),\"\"))","v":""},null,null,{"$f":"IF(ISNUMBER(D328),OdchZmerCasuDIN(1/J712,1,\"Sol\")*1000,\"\")","v":""},{"$f":"IF(ISNUMBER(N56),IF(N56<1,3, IF(AND(N56>=10,N56<=20),4, IF(N56<=1000,3,4) )),\"\")","v":""},null,null,null,null,null,{"$f":"CHOOSE(LJazyk,\"(nejlíp když je v levém horním rohu) a zmáčkne se CTRL+SHIFT+ENTER\",  \"(preferably in upper left corner) and press CTRL+SHIFT+ENTER\")","v":"(preferably in upper left corner) and press CTRL+SHIFT+ENTER"},null,null,null,null,{"$f":"IF(COUNT($AA$21:$AA$22)=2,EXP(LN($AA$21)+(ROW(Z56)-ROW($Z$24))*(LN($AA$22)-LN($AA$21))/(ROWS($Z$24:$Z$59)-1)),NA())","v":{"$error":"#N/A"}},{"$f":"IF(NOT(ISNUMBER($AA$20)),NA(),IF($AA$20>1,     EXP(N(Polynom($S$24:$T$53,$AA$20,TRUE,\"K\",0))+N(Polynom($S$24:$T$53,$AA$20,TRUE,\"K\",1))*LN(Z56)+N(Polynom($S$24:$T$53,$AA$20,TRUE,\"K\",2))*LN(Z56)^2+N(Polynom($S$24:$T$53,$AA$20,TRUE,\"K\",3))*LN(Z56)^3+N(Polynom($S$24:$T$53,$AA$20,TRUE,\"K\",4))*LN(Z56)^4+N(Polynom($S$24:$T$53,$AA$20,TRUE,\"K\",5))*LN(Z56)^5+N(Polynom($S$24:$T$53,$AA$20,TRUE,\"K\",6))*LN(Z56)^6+N(Polynom($S$24:$T$53,$AA$20,TRUE,\"K\",7))*LN(Z56)^7+N(Polynom($S$24:$T$53,$AA$20,TRUE,\"K\",8))*LN(Z56)^8+N(Polynom($S$24:$T$53,$AA$20,TRUE,\"K\",9))*LN(Z56)^9+N(Polynom($S$24:$T$53,$AA$20,TRUE,\"K\",10))*LN(Z56)^10),NA()))","v":{"$error":"#N/A"}},{"$error":"#N/A"}]
[11,{"$f":"IF(ISNUMBER(D283),D283,\"\")","v":""},null,{"$f":"IF(ISNUMBER(F284),IF(F284/1000000>=1,F284/1000000,1/(F284/1000000)),\"\")","v":""},null,{"$f":"IF(ISNUMBER(G291),G291,\"\")","v":""},{"$f":"IF(ISNUMBER(J291),J291,\"\")","v":""},{"$f":"IF(ISNUMBER(G285),G285,\"\")","v":""},{"$f":"IF(ISNUMBER(F287),IF(F287<=0, CHOOSE(LJazyk,\"Zavřeno!!\",  \"Closed!!\"),  CONCATENATE(ZaokrText(IF(F287>=1000000,F287/1000000,F287/1000),$Q$10),IF(F287/1000000>=1,\" s\",\" ms\"))),\"\")","v":""},{"$f":"IF(ISNUMBER(G287),IF(G287<=0, CHOOSE(LJazyk,\"Zavřeno!!\",  \"Closed!!\"),  CONCATENATE(ZaokrText(IF(G287>=1000000,G287/1000000,G287/1000),$Q$10),IF(G287/1000000>=1,\" s\",\" ms\"))),\"\")","v":""},{"$f":"IF(ISNUMBER(H287),IF(H287<=0, CHOOSE(LJazyk,\"Zavřeno!!\",  \"Closed!!\"),  CONCATENATE(ZaokrText(IF(H287>=1000000,H287/1000000,H287/1000),$Q$10),IF(H287/1000000>=1,\" s\",\" ms\"))),\"\")","v":""},{"$f":"IF(COUNT(F287:H287)>=3, IF( MIN(F287:H287)<=0,CHOOSE(LJazyk,\"Nelze\",  \"Can not\"), MAX(F287:H287)/MIN(F287:H287)),\"\")","v":""},null,{"$f":"IF(ISNUMBER(D328),OdchZmerCasuDIN(1/J712,1,\"Min\")*1000,\"\")","v":""},{"$f":"IF(ISNUMBER(N57),IF(N57<1,2, IF(AND(N57>=10,N57<=20),4, IF(N57<=1000,3,4) )),\"\")","v":""},null,null,null,null,null,null,null,null,null,null,{"$f":"IF(COUNT($AA$21:$AA$22)=2,EXP(LN($AA$21)+(ROW(Z57)-ROW($Z$24))*(LN($AA$22)-LN($AA$21))/(ROWS($Z$24:$Z$59)-1)),NA())","v":{"$error":"#N/A"}},{"$f":"IF(NOT(ISNUMBER($AA$20)),NA(),IF($AA$20>1,     EXP(N(Polynom($S$24:$T$53,$AA$20,TRUE,\"K\",0))+N(Polynom($S$24:$T$53,$AA$20,TRUE,\"K\",1))*LN(Z57)+N(Polynom($S$24:$T$53,$AA$20,TRUE,\"K\",2))*LN(Z57)^2+N(Polynom($S$24:$T$53,$AA$20,TRUE,\"K\",3))*LN(Z57)^3+N(Polynom($S$24:$T$53,$AA$20,TRUE,\"K\",4))*LN(Z57)^4+N(Polynom($S$24:$T$53,$AA$20,TRUE,\"K\",5))*LN(Z57)^5+N(Polynom($S$24:$T$53,$AA$20,TRUE,\"K\",6))*LN(Z57)^6+N(Polynom($S$24:$T$53,$AA$20,TRUE,\"K\",7))*LN(Z57)^7+N(Polynom($S$24:$T$53,$AA$20,TRUE,\"K\",8))*LN(Z57)^8+N(Polynom($S$24:$T$53,$AA$20,TRUE,\"K\",9))*LN(Z57)^9+N(Polynom($S$24:$T$53,$AA$20,TRUE,\"K\",10))*LN(Z57)^10),NA()))","v":{"$error":"#N/A"}},{"$error":"#N/A"}]
[null,{"$f":"IF(ISNUMBER(D283),CONCATENATE(ZaokrText(N47,O47),\" ms\"),\"\")","v":""},null,null,null,null,null,null,{"$f":"IF(G289=\"\",\"\",IF(F287<=0, \"\", IF($J287<0,CONCATENATE(ZaokrText(G289,$Q$10),\" mm\"), CHOOSE(LJazyk,\"celé okno\",  \"full open\"))))","v":""},{"$f":"IF(I289=\"\",\"\",IF(G287<=0, \"\", IF($J287<0,CONCATENATE(ZaokrText(I289,$Q$10),\" mm\"), CHOOSE(LJazyk,\"celé okno\",  \"full open\"))))","v":""},{"$f":"IF(K289=\"\",\"\",IF(H287<=0, \"\", IF($J287<0,CONCATENATE(ZaokrText(K289,$Q$10),\" mm\"), CHOOSE(LJazyk,\"celé okno\",  \"full open\"))))","v":""},null,null,{"$f":"IF(ISNUMBER(D328),OdchZmerCasuDIN(1/J712,1,\"Max\")*1000,\"\")","v":""},{"$f":"IF(ISNUMBER(N58),IF(N58<1,2, IF(AND(N58>=10,N58<=20),4, IF(N58<=1000,3,4) )),\"\")","v":""},null,null,null,null,null,null,null,null,null,null,{"$f":"IF(COUNT($AA$21:$AA$22)=2,EXP(LN($AA$21)+(ROW(Z58)-ROW($Z$24))*(LN($AA$22)-LN($AA$21))/(ROWS($Z$24:$Z$59)-1)),NA())","v":{"$error":"#N/A"}},{"$f":"IF(NOT(ISNUMBER($AA$20)),NA(),IF($AA$20>1,     EXP(N(Polynom($S$24:$T$53,$AA$20,TRUE,\"K\",0))+N(Polynom($S$24:$T$53,$AA$20,TRUE,\"K\",1))*LN(Z58)+N(Polynom($S$24:$T$53,$AA$20,TRUE,\"K\",2))*LN(Z58)^2+N(Polynom($S$24:$T$53,$AA$20,TRUE,\"K\",3))*LN(Z58)^3+N(Polynom($S$24:$T$53,$AA$20,TRUE,\"K\",4))*LN(Z58)^4+N(Polynom($S$24:$T$53,$AA$20,TRUE,\"K\",5))*LN(Z58)^5+N(Polynom($S$24:$T$53,$AA$20,TRUE,\"K\",6))*LN(Z58)^6+N(Polynom($S$24:$T$53,$AA$20,TRUE,\"K\",7))*LN(Z58)^7+N(Polynom($S$24:$T$53,$AA$20,TRUE,\"K\",8))*LN(Z58)^8+N(Polynom($S$24:$T$53,$AA$20,TRUE,\"K\",9))*LN(Z58)^9+N(Polynom($S$24:$T$53,$AA$20,TRUE,\"K\",10))*LN(Z58)^10),NA()))","v":{"$error":"#N/A"}},{"$error":"#N/A"}]
[null,null,null,null,null,null,null,{"$f":"IF(ISNUMBER(H285),H285,\"\")","v":""},null,null,null,null,null,{"$f":"IF(ISNUMBER(D343),OdchZmerCasuDIN(1/J739,1,\"Sol\")*1000,\"\")","v":""},{"$f":"IF(ISNUMBER(N59),IF(N59<1,3, IF(AND(N59>=10,N59<=20),4, IF(N59<=1000,3,4) )),\"\")","v":""},null,null,null,null,null,null,null,null,null,null,{"$f":"IF(COUNT($AA$21:$AA$22)=2,EXP(LN($AA$21)+(ROW(Z59)-ROW($Z$24))*(LN($AA$22)-LN($AA$21))/(ROWS($Z$24:$Z$59)-1)),NA())","v":{"$error":"#N/A"}},{"$f":"IF(NOT(ISNUMBER($AA$20)),NA(),IF($AA$20>1,     EXP(N(Polynom($S$24:$T$53,$AA$20,TRUE,\"K\",0))+N(Polynom($S$24:$T$53,$AA$20,TRUE,\"K\",1))*LN(Z59)+N(Polynom($S$24:$T$53,$AA$20,TRUE,\"K\",2))*LN(Z59)^2+N(Polynom($S$24:$T$53,$AA$20,TRUE,\"K\",3))*LN(Z59)^3+N(Polynom($S$24:$T$53,$AA$20,TRUE,\"K\",4))*LN(Z59)^4+N(Polynom($S$24:$T$53,$AA$20,TRUE,\"K\",5))*LN(Z59)^5+N(Polynom($S$24:$T$53,$AA$20,TRUE,\"K\",6))*LN(Z59)^6+N(Polynom($S$24:$T$53,$AA$20,TRUE,\"K\",7))*LN(Z59)^7+N(Polynom($S$24:$T$53,$AA$20,TRUE,\"K\",8))*LN(Z59)^8+N(Polynom($S$24:$T$53,$AA$20,TRUE,\"K\",9))*LN(Z59)^9+N(Polynom($S$24:$T$53,$AA$20,TRUE,\"K\",10))*LN(Z59)^10),NA()))","v":{"$error":"#N/A"}},{"$error":"#N/A"}]
[null,{"$f":"IF(ISNUMBER(D283),CONCATENATE(ZaokrText(N48,O48),\" ms - \",ZaokrText(N49,O49),\" ms\"),\"\")","v":""},null,{"$f":"IF(ISNUMBER(F284),F284/1000,\"\")","v":""},null,null,null,null,{"$f":"IF(G289=\"\",\"\",IF($J287<0,CONCATENATE(ZaokrText(G289/(F287*0.001),$Q$10),\" m/s\"),\"\"))","v":""},{"$f":"IF(I289=\"\",\"\",IF($J287<0,CONCATENATE(ZaokrText(I289/(G287*0.001),$Q$10),\" m/s\"),\"\"))","v":""},{"$f":"IF(K289=\"\",\"\",IF($J287<0,CONCATENATE(ZaokrText(K289/(H287*0.001),$Q$10),\" m/s\"),\"\"))","v":""},null,null,{"$f":"IF(ISNUMBER(D343),OdchZmerCasuDIN(1/J739,1,\"Min\")*1000,\"\")","v":""},{"$f":"IF(ISNUMBER(N60),IF(N60<1,2, IF(AND(N60>=10,N60<=20),4, IF(N60<=1000,3,4) )),\"\")","v":""},null,{"$f":"CHOOSE(LJazyk,\"Výpočet úhlu pro přechodovou výplň zobrazované oblasti gřafu z jeho rozměrů (protilehlá/přilehlé)\",  \"Calculating angle for transition fill of displayed graph area from its dimensions (opposite/abutting)\")","v":"Calculating angle for transition fill of displayed graph area from its dimensions (opposite/abutting)"}]
[12,{"$f":"IF(ISNUMBER(D298),D298,\"\")","v":""},null,{"$f":"IF(ISNUMBER(F299),IF(F299/1000000>=1,F299/1000000,1/(F299/1000000)),\"\")","v":""},null,{"$f":"IF(ISNUMBER(G306),G306,\"\")","v":""},{"$f":"IF(ISNUMBER(J306),J306,\"\")","v":""},{"$f":"IF(ISNUMBER(G300),G300,\"\")","v":""},{"$f":"IF(ISNUMBER(F302),IF(F302<=0, CHOOSE(LJazyk,\"Zavřeno!!\",  \"Closed!!\"),  CONCATENATE(ZaokrText(IF(F302>=1000000,F302/1000000,F302/1000),$Q$10),IF(F302/1000000>=1,\" s\",\" ms\"))),\"\")","v":""},{"$f":"IF(ISNUMBER(G302),IF(G302<=0, CHOOSE(LJazyk,\"Zavřeno!!\",  \"Closed!!\"),  CONCATENATE(ZaokrText(IF(G302>=1000000,G302/1000000,G302/1000),$Q$10),IF(G302/1000000>=1,\" s\",\" ms\"))),\"\")","v":""},{"$f":"IF(ISNUMBER(H302),IF(H302<=0, CHOOSE(LJazyk,\"Zavřeno!!\",  \"Closed!!\"),  CONCATENATE(ZaokrText(IF(H302>=1000000,H302/1000000,H302/1000),$Q$10),IF(H302/1000000>=1,\" s\",\" ms\"))),\"\")","v":""},{"$f":"IF(COUNT(F302:H302)>=3, IF( MIN(F302:H302)<=0,CHOOSE(LJazyk,\"Nelze\",  \"Can not\"), MAX(F302:H302)/MIN(F302:H302)),\"\")","v":""},null,{"$f":"IF(ISNUMBER(D343),OdchZmerCasuDIN(1/J739,1,\"Max\")*1000,\"\")","v":""},{"$f":"IF(ISNUMBER(N61),IF(N61<1,2, IF(AND(N61>=10,N61<=20),4, IF(N61<=1000,3,4) )),\"\")","v":""},null,{"$f":"CHOOSE(LJazyk,\"délka vodorov. strany gřafu [cm]:\",  \"graph horizontal side length [cm]:\")","v":"graph horizontal side length [cm]:"},16.600000000000001,null,{"$f":"CHOOSE(LJazyk,\"délka svislé strany gřafu [cm]:\",  \"graph vertical side length [cm]:\")","v":"graph vertical side length [cm]:"},9.4]
[null,{"$f":"IF(ISNUMBER(D298),CONCATENATE(ZaokrText(N50,O50),\" ms\"),\"\")","v":""},null,null,null,null,null,null,{"$f":"IF(G304=\"\",\"\",IF(F302<=0, \"\", IF($J302<0,CONCATENATE(ZaokrText(G304,$Q$10),\" mm\"), CHOOSE(LJazyk,\"celé okno\",  \"full open\"))))","v":""},{"$f":"IF(I304=\"\",\"\",IF(G302<=0, \"\", IF($J302<0,CONCATENATE(ZaokrText(I304,$Q$10),\" mm\"), CHOOSE(LJazyk,\"celé okno\",  \"full open\"))))","v":""},{"$f":"IF(K304=\"\",\"\",IF(H302<=0, \"\", IF($J302<0,CONCATENATE(ZaokrText(K304,$Q$10),\" mm\"), CHOOSE(LJazyk,\"celé okno\",  \"full open\"))))","v":""},null,null,null,null,null,{"$f":"IF(AND(ISNUMBER(R61),ISNUMBER(U61)),IF(R61<>0,90-DEGREES((ATAN(U61/R61))),\"\"),\"\")","v":60.47863816541836},{"$f":"CHOOSE(LJazyk,\"stupňú\",  \"degrees\")","v":"degrees"},{"$f":"CHOOSE(LJazyk,\"Úúhel je vypočtený tady z rozmněrů (nejlíp papírového vytisku) a musí se ručně vložit do gřafu: Formát zobrazované oblasti - Výplň\",  \"Angle that is calculated here from dimensions (preferably paper printout) and must be manually inserted into chart: Display area format - Fill\")","v":"Angle that is calculated here from dimensions (preferably paper printout) and must be manually inserted into chart: Display area format - Fill"}]
[null,null,null,null,null,null,null,{"$f":"IF(ISNUMBER(H300),H300,\"\")","v":""}]
[null,{"$f":"IF(ISNUMBER(D298),CONCATENATE(ZaokrText(N51,O51),\" ms - \",ZaokrText(N52,O52),\" ms\"),\"\")","v":""},null,{"$f":"IF(ISNUMBER(F299),F299/1000,\"\")","v":""},null,null,null,null,{"$f":"IF(G304=\"\",\"\",IF($J302<0,CONCATENATE(ZaokrText(G304/(F302*0.001),$Q$10),\" m/s\"),\"\"))","v":""},{"$f":"IF(I304=\"\",\"\",IF($J302<0,CONCATENATE(ZaokrText(I304/(G302*0.001),$Q$10),\" m/s\"),\"\"))","v":""},{"$f":"IF(K304=\"\",\"\",IF($J302<0,CONCATENATE(ZaokrText(K304/(H302*0.001),$Q$10),\" m/s\"),\"\"))","v":""}]
[13,{"$f":"IF(ISNUMBER(D313),D313,\"\")","v":""},null,{"$f":"IF(ISNUMBER(F314),IF(F314/1000000>=1,F314/1000000,1/(F314/1000000)),\"\")","v":""},null,{"$f":"IF(ISNUMBER(G321),G321,\"\")","v":""},{"$f":"IF(ISNUMBER(J321),J321,\"\")","v":""},{"$f":"IF(ISNUMBER(G315),G315,\"\")","v":""},{"$f":"IF(ISNUMBER(F317),IF(F317<=0, CHOOSE(LJazyk,\"Zavřeno!!\",  \"Closed!!\"),  CONCATENATE(ZaokrText(IF(F317>=1000000,F317/1000000,F317/1000),$Q$10),IF(F317/1000000>=1,\" s\",\" ms\"))),\"\")","v":""},{"$f":"IF(ISNUMBER(G317),IF(G317<=0, CHOOSE(LJazyk,\"Zavřeno!!\",  \"Closed!!\"),  CONCATENATE(ZaokrText(IF(G317>=1000000,G317/1000000,G317/1000),$Q$10),IF(G317/1000000>=1,\" s\",\" ms\"))),\"\")","v":""},{"$f":"IF(ISNUMBER(H317),IF(H317<=0, CHOOSE(LJazyk,\"Zavřeno!!\",  \"Closed!!\"),  CONCATENATE(ZaokrText(IF(H317>=1000000,H317/1000000,H317/1000),$Q$10),IF(H317/1000000>=1,\" s\",\" ms\"))),\"\")","v":""},{"$f":"IF(COUNT(F317:H317)>=3, IF( MIN(F317:H317)<=0,CHOOSE(LJazyk,\"Nelze\",  \"Can not\"), MAX(F317:H317)/MIN(F317:H317)),\"\")","v":""},null,"POZOR při přesuvech muňěk:"]
[null,{"$f":"IF(ISNUMBER(D313),CONCATENATE(ZaokrText(N53,O53),\" ms\"),\"\")","v":""},null,null,null,null,null,null,{"$f":"IF(G319=\"\",\"\",IF(F317<=0, \"\", IF($J317<0,CONCATENATE(ZaokrText(G319,$Q$10),\" mm\"), CHOOSE(LJazyk,\"celé okno\",  \"full open\"))))","v":""},{"$f":"IF(I319=\"\",\"\",IF(G317<=0, \"\", IF($J317<0,CONCATENATE(ZaokrText(I319,$Q$10),\" mm\"), CHOOSE(LJazyk,\"celé okno\",  \"full open\"))))","v":""},{"$f":"IF(K319=\"\",\"\",IF(H317<=0, \"\", IF($J317<0,CONCATENATE(ZaokrText(K319,$Q$10),\" mm\"), CHOOSE(LJazyk,\"celé okno\",  \"full open\"))))","v":""}]
[null,null,null,null,null,null,null,{"$f":"IF(ISNUMBER(H315),H315,\"\")","v":""}]
[null,{"$f":"IF(ISNUMBER(D313),CONCATENATE(ZaokrText(N54,O54),\" ms - \",ZaokrText(N55,O55),\" ms\"),\"\")","v":""},null,{"$f":"IF(ISNUMBER(F314),F314/1000,\"\")","v":""},null,null,null,null,{"$f":"IF(G319=\"\",\"\",IF($J317<0,CONCATENATE(ZaokrText(G319/(F317*0.001),$Q$10),\" m/s\"),\"\"))","v":""},{"$f":"IF(I319=\"\",\"\",IF($J317<0,CONCATENATE(ZaokrText(I319/(G317*0.001),$Q$10),\" m/s\"),\"\"))","v":""},{"$f":"IF(K319=\"\",\"\",IF($J317<0,CONCATENATE(ZaokrText(K319/(H317*0.001),$Q$10),\" m/s\"),\"\"))","v":""},null,null,"Níž jsou ještě vzorce pro toleranci rychlostí pláten !!"]
[14,{"$f":"IF(ISNUMBER(D328),D328,\"\")","v":""},null,{"$f":"IF(ISNUMBER(F329),IF(F329/1000000>=1,F329/1000000,1/(F329/1000000)),\"\")","v":""},null,{"$f":"IF(ISNUMBER(G336),G336,\"\")","v":""},{"$f":"IF(ISNUMBER(J336),J336,\"\")","v":""},{"$f":"IF(ISNUMBER(G330),G330,\"\")","v":""},{"$f":"IF(ISNUMBER(F332),IF(F332<=0, CHOOSE(LJazyk,\"Zavřeno!!\",  \"Closed!!\"),  CONCATENATE(ZaokrText(IF(F332>=1000000,F332/1000000,F332/1000),$Q$10),IF(F332/1000000>=1,\" s\",\" ms\"))),\"\")","v":""},{"$f":"IF(ISNUMBER(G332),IF(G332<=0, CHOOSE(LJazyk,\"Zavřeno!!\",  \"Closed!!\"),  CONCATENATE(ZaokrText(IF(G332>=1000000,G332/1000000,G332/1000),$Q$10),IF(G332/1000000>=1,\" s\",\" ms\"))),\"\")","v":""},{"$f":"IF(ISNUMBER(H332),IF(H332<=0, CHOOSE(LJazyk,\"Zavřeno!!\",  \"Closed!!\"),  CONCATENATE(ZaokrText(IF(H332>=1000000,H332/1000000,H332/1000),$Q$10),IF(H332/1000000>=1,\" s\",\" ms\"))),\"\")","v":""},{"$f":"IF(COUNT(F332:H332)>=3, IF( MIN(F332:H332)<=0,CHOOSE(LJazyk,\"Nelze\",  \"Can not\"), MAX(F332:H332)/MIN(F332:H332)),\"\")","v":""},null,"Pohof."]
[null,{"$f":"IF(ISNUMBER(D328),CONCATENATE(ZaokrText(N56,O56),\" ms\"),\"\")","v":""},null,null,null,null,null,null,{"$f":"IF(G334=\"\",\"\",IF(F332<=0, \"\", IF($J332<0,CONCATENATE(ZaokrText(G334,$Q$10),\" mm\"), CHOOSE(LJazyk,\"celé okno\",  \"full open\"))))","v":""},{"$f":"IF(I334=\"\",\"\",IF(G332<=0, \"\", IF($J332<0,CONCATENATE(ZaokrText(I334,$Q$10),\" mm\"), CHOOSE(LJazyk,\"celé okno\",  \"full open\"))))","v":""},{"$f":"IF(K334=\"\",\"\",IF(H332<=0, \"\", IF($J332<0,CONCATENATE(ZaokrText(K334,$Q$10),\" mm\"), CHOOSE(LJazyk,\"celé okno\",  \"full open\"))))","v":""}]
[null,null,null,null,null,null,null,{"$f":"IF(ISNUMBER(H330),H330,\"\")","v":""}]
[null,{"$f":"IF(ISNUMBER(D328),CONCATENATE(ZaokrText(N57,O57),\" ms - \",ZaokrText(N58,O58),\" ms\"),\"\")","v":""},null,{"$f":"IF(ISNUMBER(F329),F329/1000,\"\")","v":""},null,null,null,null,{"$f":"IF(G334=\"\",\"\",IF($J332<0,CONCATENATE(ZaokrText(G334/(F332*0.001),$Q$10),\" m/s\"),\"\"))","v":""},{"$f":"IF(I334=\"\",\"\",IF($J332<0,CONCATENATE(ZaokrText(I334/(G332*0.001),$Q$10),\" m/s\"),\"\"))","v":""},{"$f":"IF(K334=\"\",\"\",IF($J332<0,CONCATENATE(ZaokrText(K334/(H332*0.001),$Q$10),\" m/s\"),\"\"))","v":""}]
[15,{"$f":"IF(ISNUMBER(D343),D343,\"\")","v":""},null,{"$f":"IF(ISNUMBER(F344),IF(F344/1000000>=1,F344/1000000,1/(F344/1000000)),\"\")","v":""},null,{"$f":"IF(ISNUMBER(G351),G351,\"\")","v":""},{"$f":"IF(ISNUMBER(J351),J351,\"\")","v":""},{"$f":"IF(ISNUMBER(G345),G345,\"\")","v":""},{"$f":"IF(ISNUMBER(F347),IF(F347<=0, CHOOSE(LJazyk,\"Zavřeno!!\",  \"Closed!!\"),  CONCATENATE(ZaokrText(IF(F347>=1000000,F347/1000000,F347/1000),$Q$10),IF(F347/1000000>=1,\" s\",\" ms\"))),\"\")","v":""},{"$f":"IF(ISNUMBER(G347),IF(G347<=0, CHOOSE(LJazyk,\"Zavřeno!!\",  \"Closed!!\"),  CONCATENATE(ZaokrText(IF(G347>=1000000,G347/1000000,G347/1000),$Q$10),IF(G347/1000000>=1,\" s\",\" ms\"))),\"\")","v":""},{"$f":"IF(ISNUMBER(H347),IF(H347<=0, CHOOSE(LJazyk,\"Zavřeno!!\",  \"Closed!!\"),  CONCATENATE(ZaokrText(IF(H347>=1000000,H347/1000000,H347/1000),$Q$10),IF(H347/1000000>=1,\" s\",\" ms\"))),\"\")","v":""},{"$f":"IF(COUNT(F347:H347)>=3, IF( MIN(F347:H347)<=0,CHOOSE(LJazyk,\"Nelze\",  \"Can not\"), MAX(F347:H347)/MIN(F347:H347)),\"\")","v":""}]
[null,{"$f":"IF(ISNUMBER(D343),CONCATENATE(ZaokrText(N59,O59),\" ms\"),\"\")","v":""},null,null,null,null,null,null,{"$f":"IF(G349=\"\",\"\",IF(F347<=0, \"\", IF($J347<0,CONCATENATE(ZaokrText(G349,$Q$10),\" mm\"), CHOOSE(LJazyk,\"celé okno\",  \"full open\"))))","v":""},{"$f":"IF(I349=\"\",\"\",IF(G347<=0, \"\", IF($J347<0,CONCATENATE(ZaokrText(I349,$Q$10),\" mm\"), CHOOSE(LJazyk,\"celé okno\",  \"full open\"))))","v":""},{"$f":"IF(K349=\"\",\"\",IF(H347<=0, \"\", IF($J347<0,CONCATENATE(ZaokrText(K349,$Q$10),\" mm\"), CHOOSE(LJazyk,\"celé okno\",  \"full open\"))))","v":""}]
[null,null,null,null,null,null,null,{"$f":"IF(ISNUMBER(H345),H345,\"\")","v":""}]
[null,{"$f":"IF(ISNUMBER(D343),CONCATENATE(ZaokrText(N60,O60),\" ms - \",ZaokrText(N61,O61),\" ms\"),\"\")","v":""},null,{"$f":"IF(ISNUMBER(F344),F344/1000,\"\")","v":""},null,null,null,null,{"$f":"IF(G349=\"\",\"\",IF($J347<0,CONCATENATE(ZaokrText(G349/(F347*0.001),$Q$10),\" m/s\"),\"\"))","v":""},{"$f":"IF(I349=\"\",\"\",IF($J347<0,CONCATENATE(ZaokrText(I349/(G347*0.001),$Q$10),\" m/s\"),\"\"))","v":""},{"$f":"IF(K349=\"\",\"\",IF($J347<0,CONCATENATE(ZaokrText(K349/(H347*0.001),$Q$10),\" m/s\"),\"\"))","v":""}]
[null,{"$f":"CHOOSE(LJazyk,\"  Odchylky prům. změřeného času jsou v % hraničního času a rozptyl měřených hodnot v % max. povol. rozptylu, které povoluje DIN 19016,\"   &CHAR(10)&   \"  hodnoty >100 % jsou červené. Rychlosti pláten jsou červené když je rozdíl mezi 1. a 2. plátnem >50 %, a to jak pro celkové prům. rychlosti,\"   &CHAR(10)&   \"  tak pro poloviny běhu (viz další listy). Nepravidelnost běhu závěrky r k poloze v obrazovém okně je červeně pro rozdíly větší jak 50 % (>1,5).\",\n\"  Deviations of aver. meas. time are in % of limiting time and variances of meas. values is in % of max. permitted variance acc. to DIN 19016,\"   &CHAR(10)&   \"  values >100% are red. Curtain speeds are red when difference between 1st and 2nd curtain is >50%, and this is as for total average speeds,\"   &CHAR(10)&   \"  so for halves of run (see next sheets). Irregularity of shutter speed r to position in picture window is red for differences greater than 50% (>1.5).\")","v":"  Deviations of aver. meas. time are in % of limiting time and variances of meas. values is in % of max. permitted variance acc. to DIN 19016,\n  values >100% are red. Curtain speeds are red when difference between 1st and 2nd curtain is >50%, and this is as for total average speeds,\n  so for halves of run (see next sheets). Irregularity of shutter speed r to position in picture window is red for differences greater than 50% (>1.5)."}]
[]
[null,null,null,null,null,null,null,null,null,null,null,null,null,{"$f":"CHOOSE(LJazyk,\"Průběh časů závěrky\",  \"Shutter speeds\")","v":"Shutter speeds"}]
[null,null,null,null,null,null,null,null,null,null,null,null,null,{"$f":"CHOOSE(LJazyk,\"Časy jsou kratší než nastavené\",  \"Times are shorter than set\")","v":"Times are shorter than set"}]
[]
[]
[]
[]
[]
[]
[]
[]
[]
[]
[]
[]
[]
[]
[]
[null,null,null,null,null,null,null,null,null,null,null,null,null,{"$f":"CHOOSE(LJazyk,\"Časy jsou delší než nastavené\",  \"Times are longer than set\")","v":"Times are longer than set"}]
[null,null,null,null,null,null,null,null,null,null,null,null,null,{"$f":"CHOOSE(LJazyk,\"1 / Změřený čas [s]\",  \"1 / Measured time [s]\")","v":"1 / Measured time [s]"}]
[null,null,null,null,null,null,null,null,null,null,null,null,null,{"$f":"CHOOSE(LJazyk,\"1 / Nastavený čas [s]\",  \"1 / Set time [s]\")","v":"1 / Set time [s]"}]
[]
[null,{"$f":"CHOOSE(LJazyk,\"Rovnice časů ideální závěrky je v logaritmickém zobrazení přímka vyjádřená rovnicí y = 1 x¹ (červená úhlopříčka). Násobitel je celkový posun časů od 1 s (pro <1 do oblasti časů delších a pro >1 kratších než nastavené)\"   &   \" a exponent je různost odchylky krátkých a dlouhých časů (tj. sklon, pro <1 směrem ke kratším časům závěrka zpomaluje a pro >1 zrychluje). Pro měřenou závěrku je zde tato rovnice spočítána a v grafu je zobrazena černou čárou.\"   &   \" Když je v grafu ještě šedá tečkovaná čára, není optimální proklad změř. daty v logaritmickém zobrazení přímka, ale polynom zobrazený touto šedou tečkovanou čárou.\",\n\"Equation of speeds of ideal shutter in logarithmic presentation is line expressed by y = 1 x¹ (red diagonal). Multiplier is total time shift from 1 s (for <1 to region of longer times and for >1 to region of shorter times than set)\"   &   \" and exponent is difference of deviation of short and long times (i.e. slope, for <1 towards shorter times shutter decelerates and for >1 it accelerates). For tested shutter this equation is calculated here and shown in graph by black line.\"   &   \" When graph also contains grey dotted line, optimal interpolation of data in log. presentation is not direct line, but polynomial shown by this grey dotted line.\")","v":"Equation of speeds of ideal shutter in logarithmic presentation is line expressed by y = 1 x¹ (red diagonal). Multiplier is total time shift from 1 s (for <1 to region of longer times and for >1 to region of shorter times than set) and exponent is difference of deviation of short and long times (i.e. slope, for <1 towards shorter times shutter decelerates and for >1 it accelerates). For tested shutter this equation is calculated here and shown in graph by black line. When graph also contains grey dotted line, optimal interpolation of data in log. presentation is not direct line, but polynomial shown by this grey dotted line."}]
[]
[]
[]
[null,null,null,null,{"$f":"IF(ISNUMBER(U42),U42,\"\")","v":""},null,null,{"$f":"IF(ISNUMBER(V42),V42,\"\")","v":""}]
[]
[null,{"$f":"CHOOSE(LJazyk,\"Vysvětlivky k r na první straně a k dalšímu značení použitému v následujících listech dle DIN 19 016:\",  \"Explanations for r on first page and for other symbols used in following sheets according to DIN 19 016:\")","v":"Explanations for r on first page and for other symbols used in following sheets according to DIN 19 016:"}]
[null,"r",{"$f":"CHOOSE(LJazyk,\" nepravidelnost dle odstavce 2.2.8 vzorce (6), upraveného pomocí vzorce (1) úvahou E = konst. na r = temax / temin\",  \" irregularity acc. to para. 2.2.8 of formula (6), modified by formula (1) by taking E = const. on r = temax / temin\")","v":" irregularity acc. to para. 2.2.8 of formula (6), modified by formula (1) by taking E = const. on r = temax / temin"}]
[null,{"$f":"CHOOSE(LJazyk,\"Vypočtené časy dle DIN 19 016\",  \"Calculated times according to DIN 19 016\")","v":"Calculated times according to DIN 19 016"},null,null,null,null,null,{"$f":"CHOOSE(LJazyk,\"Změřené časy z měřiče VFMOTO a vypočtené φ rychlosti\",  \" Times measured by VFMOTO and calculated φ speeds\")","v":" Times measured by VFMOTO and calculated φ speeds"}]
[null,"te1",{"$f":"CHOOSE(LJazyk,\" efektivní čas otevření na začátku okna\",  \" effective opening time at window beginning\")","v":" effective opening time at window beginning"},null,null,null,null,"Shutter",{"$f":"CHOOSE(LJazyk,\" čas otevření závěrky ve středu obraz. okna\",  \" shutter opening time in image window centre\")","v":" shutter opening time in image window centre"}]
[null,"te2",{"$f":"CHOOSE(LJazyk,\" efektivní čas otevření ve středu okna\",  \" effective opening time in window centre\")","v":" effective opening time in window centre"},null,null,null,null,"C1",{"$f":"CHOOSE(LJazyk,\" hodnoty běhu prvního plátna přes celé okno\",  \" values of run of first curtain via whole window\")","v":" values of run of first curtain via whole window"}]
[null,"te3",{"$f":"CHOOSE(LJazyk,\" efektivní čas otevření na konci okna\",  \" effective opening time at window end\")","v":" effective opening time at window end"},null,null,null,null,"C2",{"$f":"CHOOSE(LJazyk,\" hodnoty běhu druhého plátna přes celé okno\",  \" values of run of 2nd curtain via whole window\")","v":" values of run of 2nd curtain via whole window"}]
[null,"t1",{"$f":"CHOOSE(LJazyk,\" otevírací čas (tj. čas běhu prvního plátna)\",  \" opening time (i.e. running time of first curtain)\")","v":" opening time (i.e. running time of first curtain)"},null,null,null,null,"C1 1th",{"$f":"CHOOSE(LJazyk,\" hodnoty běhu 1. plátna přes 1. polovinu okna\",  \" 1st curtain run values for 1st half of window\")","v":" 1st curtain run values for 1st half of window"}]
[null,"t2",{"$f":"CHOOSE(LJazyk,\" čas plného otevření (pokud je záporný tak není\n otevřeno celé okno, ale běží jen štěrbina)\",\n  \" time of full opening (if negative then it is not\n opened whole window, but only slit is running)\")","v":" time of full opening (if negative then it is not\n opened whole window, but only slit is running)"},null,null,null,null,"C1 2nd",{"$f":"CHOOSE(LJazyk,\" hodnoty běhu 1. plátna přes 2. polovinu okna\",  \" 1st curtain run values for 2st half of window\")","v":" 1st curtain run values for 2st half of window"}]
[null,"t3",{"$f":"CHOOSE(LJazyk,\" zavírací čas (tj. čas běhu druhého plátna)\",  \" closing time (i.e. running time of second curtain)\")","v":" closing time (i.e. running time of second curtain)"},null,null,null,null,"C2 1th",{"$f":"CHOOSE(LJazyk,\" hodnoty běhu 2. plátna přes 1. polovinu okna\",  \" 2st curtain run values for 1st half of window\")","v":" 2st curtain run values for 1st half of window"}]
[null,"T",{"$f":"CHOOSE(LJazyk,\" společný (celkový) čas činnosti závěrky\",  \" common (total) activity time of shutter\")","v":" common (total) activity time of shutter"},null,null,null,null,"C2 2nd",{"$f":"CHOOSE(LJazyk,\" hodnoty běhu 2. plátna přes 2. polovinu okna\",  \" 2st curtain run values for 2st half of window\")","v":" 2st curtain run values for 2st half of window"}]
[]
[]
[null,{"$f":"CHOOSE(LJazyk,\"Obrázek 3. z DIN 19 016\",  \"Figure 3. from DIN 19 016\")","v":"Figure 3. from DIN 19 016"}]
[]
[null,{"$f":"CHOOSE(LJazyk,\"   Weg-Zeit-Diagramm\n    = Časový diagram běhu závěrky\",\n\"   Weg-Zeit-Diagramm\n    = Shutter timing graph\")","v":"   Weg-Zeit-Diagramm\n    = Shutter timing graph"}]
[]
[]
[null,{"$f":"CHOOSE(LJazyk,\"   Ablaufweg des Verschlusses\n     = Dráha běhu závěrky\",\n\"   Ablaufweg des Verschlusses\n     = Shutter running path\")","v":"   Ablaufweg des Verschlusses\n     = Shutter running path"}]
[]
[]
[null,{"$f":"CHOOSE(LJazyk,\"   Bildfenster = Obrazové okno\",  \"   Bildfenster = Image window\")","v":"   Bildfenster = Image window"}]
[]
[null,{"$f":"CHOOSE(LJazyk,\"   Schlitzkanten = Okraje štěrbiny\",  \"   Schlitzkanten = Edges of slit\")","v":"   Schlitzkanten = Edges of slit"}]
[]
[null,{"$f":"CHOOSE(LJazyk,\"   Zeit = Čas\",  \"   Zeit = Time\")","v":"   Zeit = Time"}]
[]
[]
[null,{"$f":"CHOOSE(LJazyk,\"Nastavený čas:\",  \"Seleced time:\")","v":"Seleced time:"},null,{"$f":"IF(ISNUMBER(F134),IF(J361>1,J361,1/J361),\"\")","v":""},null,"Shutter"," C1","C2"," C1 1th"," C1 2nd"," C2 1th"," C2 2nd"]
[null,{"$f":"CHOOSE(LJazyk,\"Průměrné změřené hodnoty [μs]:\",  \"Average measured values [μs]:\")","v":"Average measured values [μs]:"},null,null,null,{"$f":"IF(COUNT(F364:F383)>0,AVERAGE(F364:F383),\"\")","v":""},"","","","","",""]
[null,{"$f":"CHOOSE(LJazyk,\"Průměrná rychlost běhu pláten [m/s]:\",  \"Average curtain running speed [m/s]:\")","v":"Average curtain running speed [m/s]:"},null,null,null," --",{"$f":"IF(ISNUMBER(G134),($J$6*0.001)/(G134*0.000001),\"\")","v":""},{"$f":"IF(ISNUMBER(H134),($J$6*0.001)/(H134*0.000001),\"\")","v":""},{"$f":"IF(ISNUMBER(I134),($J$6*0.001/2)/(I134*0.000001),\"\")","v":""},{"$f":"IF(ISNUMBER(J134),($J$6*0.001/2)/(J134*0.000001),\"\")","v":""},{"$f":"IF(ISNUMBER(K134),($J$6*0.001/2)/(K134*0.000001),\"\")","v":""},{"$f":"IF(ISNUMBER(L134),($J$6*0.001/2)/(L134*0.000001),\"\")","v":""},null,{"$f":"IF(COUNT(G135:L135)>=6,IF(OR(MAX(G135:H135)/MIN(G135:H135)>$N$11, MAX(I135,K135)/MIN(I135,K135)>$N$11, MAX(J135,L135)/MIN(J135,L135)>$N$11),\"Velký rozdíl\",\"OK\"),\"\")","v":""}]
[null,{"$f":"CHOOSE(LJazyk,\"Dílčí časové intervaly závěrky [μs]:\n(značení dle DIN 19 016 - 06.1983)\",\n\"Partial shutter speed intervals [μs]:\n(according to DIN 19 016 - 06.1983)\")","v":"Partial shutter speed intervals [μs]:\n(according to DIN 19 016 - 06.1983)"},null,null,null,"te1","te2","te3","t1","t2","t3","T"]
[null,null,null,null,null,{"$f":"IF(COUNT($F134:$L134)=7,G137+I134-K134,\"\")","v":""},{"$f":"IF(COUNT($F134:$L134)=7,F134,\"\")","v":""},{"$f":"IF(COUNT($F134:$L134)=7,G137-J134+L134,\"\")","v":""},{"$f":"IF(COUNT($F134:$L134)=7,G134,\"\")","v":""},{"$f":"IF(COUNT($F134:$L134)=7,L137-G134-H134,\"\")","v":""},{"$f":"IF(COUNT($F134:$L134)=7,H134,\"\")","v":""},{"$f":"IF(COUNT($F134:$L134)=7,(G134+H137+F137+H134)/2,\"\")","v":""}]
[null,{"$f":"CHOOSE(LJazyk,\"Šířka štěrbiny závěrky w [mm]:\",  \"Shutter slit width w [mm]:\")","v":"Shutter slit width w [mm]:"},null,null,null,null,{"$f":"CHOOSE(LJazyk,\"začátek běhu\",  \"beginning of run\")","v":"beginning of run"},null,{"$f":"CHOOSE(LJazyk,\"střed běhu\",  \"center of run\")","v":"center of run"},null,{"$f":"CHOOSE(LJazyk,\"konec běhu\",  \"end of run\")","v":"end of run"}]
[null,null,null,null,null,null,{"$f":"IF(ISNUMBER($L137),IF($J137<0,Sirka_sterbiny(G144:H146,J144:K146, $J$6, G134, H134, I134, K134, L134, L137, F137, H137, 1),CHOOSE(LJazyk,\"otevřeno celé okno\",  \"full window is open\")),\"\")","v":""},null,{"$f":"IF(ISNUMBER($L137),IF($J137<0,Sirka_sterbiny(G144:H146,J144:K146, $J$6, G134, H134, I134, K134, L134, L137, F137, H137, 2),CHOOSE(LJazyk,\"otevřeno celé okno\",  \"full window is open\")),\"\")","v":""},null,{"$f":"IF(ISNUMBER($L137),IF($J137<0,Sirka_sterbiny(G144:H146,J144:K146, $J$6, G134, H134, I134, K134, L134, L137, F137, H137, 3),CHOOSE(LJazyk,\"otevřeno celé okno\",  \"full window is open\")),\"\")","v":""}]
[null,{"$f":"CHOOSE(LJazyk,\"Výsledné hodnoty:\",  \"Resulting values:\")","v":"Resulting values:"},null,{"$f":"CHOOSE(LJazyk,\"φ změř. čas (střed okna)\",  \"φ meas. time (in center)\")","v":"φ meas. time (in center)"},null,null,{"$f":"CHOOSE(LJazyk,\"Odch. φ změř. času DIN19016\",  \"Dev. of φ meas. time DIN19016\")","v":"Dev. of φ meas. time DIN19016"},null,null,{"$f":"CHOOSE(LJazyk,\"Rozptyl dle DIN19016\",  \"Variance acc. to DIN19016\")","v":"Variance acc. to DIN19016"}]
[null,null,null,{"$f":"IF(ISNUMBER(F134),IF(F134/1000000>1,F134/1000000,1/(F134/1000000)),\"\")","v":""},null,null,{"$f":"IF(AND(ISNUMBER(D141),ISNUMBER(D133)),OdchZmerCasuDIN(1/J361,F134/1000000,\"%\"),\"\")","v":""},null,null,{"$f":"IF(AND(ISNUMBER(D141),ISNUMBER(D133)),StabilitaDIN_Vfmoto(F364:F383, 1/J361,F134/1000000),\"\")","v":""}]
[null,null,null,null,null,null,"1. plátno",null,null,"2. plátno"]
[null,"Vstupní oblasti pro fuňkci polynom",null,null,null,null,"čas [s]","vzd [mm]",null,"čas [s]","vzd [mm]"]
[null,null,null,null,null,null,0,0,null,0,0]
[null,null,null,null,null,null,{"$f":"IF(ISNUMBER(I134),I134*0.000001,\"\")","v":""},{"$f":"IF(ISNUMBER($J$6),$J$6/2,\"\")","v":14.7},null,{"$f":"IF(ISNUMBER(K134),K134*0.000001,\"\")","v":""},{"$f":"IF(ISNUMBER($J$6),$J$6/2,\"\")","v":14.7}]
[null,null,null,null,null,null,{"$f":"IF(ISNUMBER(G134),G134*0.000001,\"\")","v":""},{"$f":"IF(ISNUMBER($J$6),$J$6,\"\")","v":29.4},null,{"$f":"IF(ISNUMBER(H134),H134*0.000001,\"\")","v":""},{"$f":"IF(ISNUMBER($J$6),$J$6,\"\")","v":29.4}]
[]
[null,{"$f":"CHOOSE(LJazyk,\"Nastavený čas:\",  \"Seleced time:\")","v":"Seleced time:"},null,{"$f":"IF(ISNUMBER(F149),IF(J388>1,J388,1/J388),\"\")","v":""},null,"Shutter"," C1","C2"," C1 1th"," C1 2nd"," C2 1th"," C2 2nd"]
[null,{"$f":"CHOOSE(LJazyk,\"Průměrné změřené hodnoty [μs]:\",  \"Average measured values [μs]:\")","v":"Average measured values [μs]:"},null,null,null,{"$f":"IF(COUNT(F391:F410)>0,AVERAGE(F391:F410),\"\")","v":""},"","","","","",""]
[null,{"$f":"CHOOSE(LJazyk,\"Průměrná rychlost běhu pláten [m/s]:\",  \"Average curtain running speed [m/s]:\")","v":"Average curtain running speed [m/s]:"},null,null,null," --",{"$f":"IF(ISNUMBER(G149),($J$6*0.001)/(G149*0.000001),\"\")","v":""},{"$f":"IF(ISNUMBER(H149),($J$6*0.001)/(H149*0.000001),\"\")","v":""},{"$f":"IF(ISNUMBER(I149),($J$6*0.001/2)/(I149*0.000001),\"\")","v":""},{"$f":"IF(ISNUMBER(J149),($J$6*0.001/2)/(J149*0.000001),\"\")","v":""},{"$f":"IF(ISNUMBER(K149),($J$6*0.001/2)/(K149*0.000001),\"\")","v":""},{"$f":"IF(ISNUMBER(L149),($J$6*0.001/2)/(L149*0.000001),\"\")","v":""},null,{"$f":"IF(COUNT(G150:L150)>=6,IF(OR(MAX(G150:H150)/MIN(G150:H150)>$N$11, MAX(I150,K150)/MIN(I150,K150)>$N$11, MAX(J150,L150)/MIN(J150,L150)>$N$11),\"Velký rozdíl\",\"OK\"),\"\")","v":""}]
[null,{"$f":"CHOOSE(LJazyk,\"Dílčí časové intervaly závěrky [μs]:\n(značení dle DIN 19 016 - 06.1983)\",\n\"Partial shutter speed intervals [μs]:\n(according to DIN 19 016 - 06.1983)\")","v":"Partial shutter speed intervals [μs]:\n(according to DIN 19 016 - 06.1983)"},null,null,null,"te1","te2","te3","t1","t2","t3","T"]
[null,null,null,null,null,{"$f":"IF(COUNT($F149:$L149)=7,G152+I149-K149,\"\")","v":""},{"$f":"IF(COUNT($F149:$L149)=7,F149,\"\")","v":""},{"$f":"IF(COUNT($F149:$L149)=7,G152-J149+L149,\"\")","v":""},{"$f":"IF(COUNT($F149:$L149)=7,G149,\"\")","v":""},{"$f":"IF(COUNT($F149:$L149)=7,L152-G149-H149,\"\")","v":""},{"$f":"IF(COUNT($F149:$L149)=7,H149,\"\")","v":""},{"$f":"IF(COUNT($F149:$L149)=7,(G149+H152+F152+H149)/2,\"\")","v":""}]
[null,{"$f":"CHOOSE(LJazyk,\"Šířka štěrbiny závěrky w [mm]:\",  \"Shutter slit width w [mm]:\")","v":"Shutter slit width w [mm]:"},null,null,null,null,{"$f":"CHOOSE(LJazyk,\"začátek běhu\",  \"beginning of run\")","v":"beginning of run"},null,{"$f":"CHOOSE(LJazyk,\"střed běhu\",  \"center of run\")","v":"center of run"},null,{"$f":"CHOOSE(LJazyk,\"konec běhu\",  \"end of run\")","v":"end of run"}]
[null,null,null,null,null,null,{"$f":"IF(ISNUMBER($L152),IF($J152<0,Sirka_sterbiny(G159:H161,J159:K161, $J$6, G149, H149, I149, K149, L149, L152, F152, H152, 1),CHOOSE(LJazyk,\"otevřeno celé okno\",  \"full window is open\")),\"\")","v":""},null,{"$f":"IF(ISNUMBER($L152),IF($J152<0,Sirka_sterbiny(G159:H161,J159:K161, $J$6, G149, H149, I149, K149, L149, L152, F152, H152, 2),CHOOSE(LJazyk,\"otevřeno celé okno\",  \"full window is open\")),\"\")","v":""},null,{"$f":"IF(ISNUMBER($L152),IF($J152<0,Sirka_sterbiny(G159:H161,J159:K161, $J$6, G149, H149, I149, K149, L149, L152, F152, H152, 3),CHOOSE(LJazyk,\"otevřeno celé okno\",  \"full window is open\")),\"\")","v":""}]
[null,{"$f":"CHOOSE(LJazyk,\"Výsledné hodnoty:\",  \"Resulting values:\")","v":"Resulting values:"},null,{"$f":"CHOOSE(LJazyk,\"φ změř. čas (střed okna)\",  \"φ meas. time (in center)\")","v":"φ meas. time (in center)"},null,null,{"$f":"CHOOSE(LJazyk,\"Odch. φ změř. času DIN19016\",  \"Dev. of φ meas. time DIN19016\")","v":"Dev. of φ meas. time DIN19016"},null,null,{"$f":"CHOOSE(LJazyk,\"Rozptyl dle DIN19016\",  \"Variance acc. to DIN19016\")","v":"Variance acc. to DIN19016"}]
[null,null,null,{"$f":"IF(ISNUMBER(F149),IF(F149/1000000>1,F149/1000000,1/(F149/1000000)),\"\")","v":""},null,null,{"$f":"IF(AND(ISNUMBER(D156),ISNUMBER(D148)),OdchZmerCasuDIN(1/J388,F149/1000000,\"%\"),\"\")","v":""},null,null,{"$f":"IF(AND(ISNUMBER(D156),ISNUMBER(D148)),StabilitaDIN_Vfmoto(F391:F410, 1/J388, F149/1000000),\"\")","v":""}]
[null,null,null,null,null,null,"1. plátno",null,null,"2. plátno"]
[null,"Vstupní oblasti pro fuňkci polynom",null,null,null,null,"čas [s]","vzd [mm]",null,"čas [s]","vzd [mm]"]
[null,null,null,null,null,null,0,0,null,0,0]
[null,null,null,null,null,null,{"$f":"IF(ISNUMBER(I149),I149*0.000001,\"\")","v":""},{"$f":"IF(ISNUMBER($J$6),$J$6/2,\"\")","v":14.7},null,{"$f":"IF(ISNUMBER(K149),K149*0.000001,\"\")","v":""},{"$f":"IF(ISNUMBER($J$6),$J$6/2,\"\")","v":14.7}]
[null,null,null,null,null,null,{"$f":"IF(ISNUMBER(G149),G149*0.000001,\"\")","v":""},{"$f":"IF(ISNUMBER($J$6),$J$6,\"\")","v":29.4},null,{"$f":"IF(ISNUMBER(H149),H149*0.000001,\"\")","v":""},{"$f":"IF(ISNUMBER($J$6),$J$6,\"\")","v":29.4}]
[]
[null,{"$f":"CHOOSE(LJazyk,\"Nastavený čas:\",  \"Seleced time:\")","v":"Seleced time:"},null,{"$f":"IF(ISNUMBER(F164),IF(J415>1,J415,1/J415),\"\")","v":""},null,"Shutter"," C1","C2"," C1 1th"," C1 2nd"," C2 1th"," C2 2nd"]
[null,{"$f":"CHOOSE(LJazyk,\"Průměrné změřené hodnoty [μs]:\",  \"Average measured values [μs]:\")","v":"Average measured values [μs]:"},null,null,null,{"$f":"IF(COUNT(F418:F437)>0,AVERAGE(F418:F437),\"\")","v":""},"","","","","",""]
[null,{"$f":"CHOOSE(LJazyk,\"Průměrná rychlost běhu pláten [m/s]:\",  \"Average curtain running speed [m/s]:\")","v":"Average curtain running speed [m/s]:"},null,null,null," --",{"$f":"IF(ISNUMBER(G164),($J$6*0.001)/(G164*0.000001),\"\")","v":""},{"$f":"IF(ISNUMBER(H164),($J$6*0.001)/(H164*0.000001),\"\")","v":""},{"$f":"IF(ISNUMBER(I164),($J$6*0.001/2)/(I164*0.000001),\"\")","v":""},{"$f":"IF(ISNUMBER(J164),($J$6*0.001/2)/(J164*0.000001),\"\")","v":""},{"$f":"IF(ISNUMBER(K164),($J$6*0.001/2)/(K164*0.000001),\"\")","v":""},{"$f":"IF(ISNUMBER(L164),($J$6*0.001/2)/(L164*0.000001),\"\")","v":""},null,{"$f":"IF(COUNT(G165:L165)>=6,IF(OR(MAX(G165:H165)/MIN(G165:H165)>$N$11, MAX(I165,K165)/MIN(I165,K165)>$N$11, MAX(J165,L165)/MIN(J165,L165)>$N$11),\"Velký rozdíl\",\"OK\"),\"\")","v":""}]
[null,{"$f":"CHOOSE(LJazyk,\"Dílčí časové intervaly závěrky [μs]:\n(značení dle DIN 19 016 - 06.1983)\",\n\"Partial shutter speed intervals [μs]:\n(according to DIN 19 016 - 06.1983)\")","v":"Partial shutter speed intervals [μs]:\n(according to DIN 19 016 - 06.1983)"},null,null,null,"te1","te2","te3","t1","t2","t3","T"]
[null,null,null,null,null,{"$f":"IF(COUNT($F164:$L164)=7,G167+I164-K164,\"\")","v":""},{"$f":"IF(COUNT($F164:$L164)=7,F164,\"\")","v":""},{"$f":"IF(COUNT($F164:$L164)=7,G167-J164+L164,\"\")","v":""},{"$f":"IF(COUNT($F164:$L164)=7,G164,\"\")","v":""},{"$f":"IF(COUNT($F164:$L164)=7,L167-G164-H164,\"\")","v":""},{"$f":"IF(COUNT($F164:$L164)=7,H164,\"\")","v":""},{"$f":"IF(COUNT($F164:$L164)=7,(G164+H167+F167+H164)/2,\"\")","v":""}]
[null,{"$f":"CHOOSE(LJazyk,\"Šířka štěrbiny závěrky w [mm]:\",  \"Shutter slit width w [mm]:\")","v":"Shutter slit width w [mm]:"},null,null,null,null,{"$f":"CHOOSE(LJazyk,\"začátek běhu\",  \"beginning of run\")","v":"beginning of run"},null,{"$f":"CHOOSE(LJazyk,\"střed běhu\",  \"center of run\")","v":"center of run"},null,{"$f":"CHOOSE(LJazyk,\"konec běhu\",  \"end of run\")","v":"end of run"}]
[null,null,null,null,null,null,{"$f":"IF(ISNUMBER($L167),IF($J167<0,Sirka_sterbiny(G174:H176,J174:K176, $J$6, G164, H164, I164, K164, L164, L167, F167, H167, 1),CHOOSE(LJazyk,\"otevřeno celé okno\",  \"full window is open\")),\"\")","v":""},null,{"$f":"IF(ISNUMBER($L167),IF($J167<0,Sirka_sterbiny(G174:H176,J174:K176, $J$6, G164, H164, I164, K164, L164, L167, F167, H167, 2),CHOOSE(LJazyk,\"otevřeno celé okno\",  \"full window is open\")),\"\")","v":""},null,{"$f":"IF(ISNUMBER($L167),IF($J167<0,Sirka_sterbiny(G174:H176,J174:K176, $J$6, G164, H164, I164, K164, L164, L167, F167, H167, 3),CHOOSE(LJazyk,\"otevřeno celé okno\",  \"full window is open\")),\"\")","v":""}]
[null,{"$f":"CHOOSE(LJazyk,\"Výsledné hodnoty:\",  \"Resulting values:\")","v":"Resulting values:"},null,{"$f":"CHOOSE(LJazyk,\"φ změř. čas (střed okna)\",  \"φ meas. time (in center)\")","v":"φ meas. time (in center)"},null,null,{"$f":"CHOOSE(LJazyk,\"Odch. φ změř. času DIN19016\",  \"Dev. of φ meas. time DIN19016\")","v":"Dev. of φ meas. time DIN19016"},null,null,{"$f":"CHOOSE(LJazyk,\"Rozptyl dle DIN19016\",  \"Variance acc. to DIN19016\")","v":"Variance acc. to DIN19016"}]
[null,null,null,{"$f":"IF(ISNUMBER(F164),IF(F164/1000000>1,F164/1000000,1/(F164/1000000)),\"\")","v":""},null,null,{"$f":"IF(AND(ISNUMBER(D171),ISNUMBER(D163)),OdchZmerCasuDIN(1/J415,F164/1000000,\"%\"),\"\")","v":""},null,null,{"$f":"IF(AND(ISNUMBER(D171),ISNUMBER(D163)),StabilitaDIN_Vfmoto(F418:F437, 1/J415,F164/1000000),\"\")","v":""}]
[null,null,null,null,null,null,"1. plátno",null,null,"2. plátno"]
[null,"Vstupní oblasti pro fuňkci polynom",null,null,null,null,"čas [s]","vzd [mm]",null,"čas [s]","vzd [mm]"]
[null,null,null,null,null,null,0,0,null,0,0]
[null,null,null,null,null,null,{"$f":"IF(ISNUMBER(I164),I164*0.000001,\"\")","v":""},{"$f":"IF(ISNUMBER($J$6),$J$6/2,\"\")","v":14.7},null,{"$f":"IF(ISNUMBER(K164),K164*0.000001,\"\")","v":""},{"$f":"IF(ISNUMBER($J$6),$J$6/2,\"\")","v":14.7}]
[null,null,null,null,null,null,{"$f":"IF(ISNUMBER(G164),G164*0.000001,\"\")","v":""},{"$f":"IF(ISNUMBER($J$6),$J$6,\"\")","v":29.4},null,{"$f":"IF(ISNUMBER(H164),H164*0.000001,\"\")","v":""},{"$f":"IF(ISNUMBER($J$6),$J$6,\"\")","v":29.4}]
[]
[null,{"$f":"CHOOSE(LJazyk,\"Nastavený čas:\",  \"Seleced time:\")","v":"Seleced time:"},null,{"$f":"IF(ISNUMBER(F179),IF(J442>1,J442,1/J442),\"\")","v":""},null,"Shutter"," C1","C2"," C1 1th"," C1 2nd"," C2 1th"," C2 2nd"]
[null,{"$f":"CHOOSE(LJazyk,\"Průměrné změřené hodnoty [μs]:\",  \"Average measured values [μs]:\")","v":"Average measured values [μs]:"},null,null,null,{"$f":"IF(COUNT(F445:F464)>0,AVERAGE(F445:F464),\"\")","v":""},"","","","","",""]
[null,{"$f":"CHOOSE(LJazyk,\"Průměrná rychlost běhu pláten [m/s]:\",  \"Average curtain running speed [m/s]:\")","v":"Average curtain running speed [m/s]:"},null,null,null," --",{"$f":"IF(ISNUMBER(G179),($J$6*0.001)/(G179*0.000001),\"\")","v":""},{"$f":"IF(ISNUMBER(H179),($J$6*0.001)/(H179*0.000001),\"\")","v":""},{"$f":"IF(ISNUMBER(I179),($J$6*0.001/2)/(I179*0.000001),\"\")","v":""},{"$f":"IF(ISNUMBER(J179),($J$6*0.001/2)/(J179*0.000001),\"\")","v":""},{"$f":"IF(ISNUMBER(K179),($J$6*0.001/2)/(K179*0.000001),\"\")","v":""},{"$f":"IF(ISNUMBER(L179),($J$6*0.001/2)/(L179*0.000001),\"\")","v":""},null,{"$f":"IF(COUNT(G180:L180)>=6,IF(OR(MAX(G180:H180)/MIN(G180:H180)>$N$11, MAX(I180,K180)/MIN(I180,K180)>$N$11, MAX(J180,L180)/MIN(J180,L180)>$N$11),\"Velký rozdíl\",\"OK\"),\"\")","v":""}]
[null,{"$f":"CHOOSE(LJazyk,\"Dílčí časové intervaly závěrky [μs]:\n(značení dle DIN 19 016 - 06.1983)\",\n\"Partial shutter speed intervals [μs]:\n(according to DIN 19 016 - 06.1983)\")","v":"Partial shutter speed intervals [μs]:\n(according to DIN 19 016 - 06.1983)"},null,null,null,"te1","te2","te3","t1","t2","t3","T"]
[null,null,null,null,null,{"$f":"IF(COUNT($F179:$L179)=7,G182+I179-K179,\"\")","v":""},{"$f":"IF(COUNT($F179:$L179)=7,F179,\"\")","v":""},{"$f":"IF(COUNT($F179:$L179)=7,G182-J179+L179,\"\")","v":""},{"$f":"IF(COUNT($F179:$L179)=7,G179,\"\")","v":""},{"$f":"IF(COUNT($F179:$L179)=7,L182-G179-H179,\"\")","v":""},{"$f":"IF(COUNT($F179:$L179)=7,H179,\"\")","v":""},{"$f":"IF(COUNT($F179:$L179)=7,(G179+H182+F182+H179)/2,\"\")","v":""}]
[null,{"$f":"CHOOSE(LJazyk,\"Šířka štěrbiny závěrky w [mm]:\",  \"Shutter slit width w [mm]:\")","v":"Shutter slit width w [mm]:"},null,null,null,null,{"$f":"CHOOSE(LJazyk,\"začátek běhu\",  \"beginning of run\")","v":"beginning of run"},null,{"$f":"CHOOSE(LJazyk,\"střed běhu\",  \"center of run\")","v":"center of run"},null,{"$f":"CHOOSE(LJazyk,\"konec běhu\",  \"end of run\")","v":"end of run"}]
[null,null,null,null,null,null,{"$f":"IF(ISNUMBER($L182),IF($J182<0,Sirka_sterbiny(G189:H191,J189:K191, $J$6, G179, H179, I179, K179, L179, L182, F182, H182, 1),CHOOSE(LJazyk,\"otevřeno celé okno\",  \"full window is open\")),\"\")","v":""},null,{"$f":"IF(ISNUMBER($L182),IF($J182<0,Sirka_sterbiny(G189:H191,J189:K191, $J$6, G179, H179, I179, K179, L179, L182, F182, H182, 2),CHOOSE(LJazyk,\"otevřeno celé okno\",  \"full window is open\")),\"\")","v":""},null,{"$f":"IF(ISNUMBER($L182),IF($J182<0,Sirka_sterbiny(G189:H191,J189:K191, $J$6, G179, H179, I179, K179, L179, L182, F182, H182, 3),CHOOSE(LJazyk,\"otevřeno celé okno\",  \"full window is open\")),\"\")","v":""}]
[null,{"$f":"CHOOSE(LJazyk,\"Výsledné hodnoty:\",  \"Resulting values:\")","v":"Resulting values:"},null,{"$f":"CHOOSE(LJazyk,\"φ změř. čas (střed okna)\",  \"φ meas. time (in center)\")","v":"φ meas. time (in center)"},null,null,{"$f":"CHOOSE(LJazyk,\"Odch. φ změř. času DIN19016\",  \"Dev. of φ meas. time DIN19016\")","v":"Dev. of φ meas. time DIN19016"},null,null,{"$f":"CHOOSE(LJazyk,\"Rozptyl dle DIN19016\",  \"Variance acc. to DIN19016\")","v":"Variance acc. to DIN19016"}]
[null,null,null,{"$f":"IF(ISNUMBER(F179),IF(F179/1000000>1,F179/1000000,1/(F179/1000000)),\"\")","v":""},null,null,{"$f":"IF(AND(ISNUMBER(D186),ISNUMBER(D178)),OdchZmerCasuDIN(1/J442,F179/1000000,\"%\"),\"\")","v":""},null,null,{"$f":"IF(AND(ISNUMBER(D186),ISNUMBER(D178)),StabilitaDIN_Vfmoto(F445:F464, 1/J442,F179/1000000),\"\")","v":""}]
[null,null,null,null,null,null,"1. plátno",null,null,"2. plátno"]
[null,"Vstupní oblasti pro fuňkci polynom",null,null,null,null,"čas [s]","vzd [mm]",null,"čas [s]","vzd [mm]"]
[null,null,null,null,null,null,0,0,null,0,0]
[null,null,null,null,null,null,{"$f":"IF(ISNUMBER(I179),I179*0.000001,\"\")","v":""},{"$f":"IF(ISNUMBER($J$6),$J$6/2,\"\")","v":14.7},null,{"$f":"IF(ISNUMBER(K179),K179*0.000001,\"\")","v":""},{"$f":"IF(ISNUMBER($J$6),$J$6/2,\"\")","v":14.7}]
[null,null,null,null,null,null,{"$f":"IF(ISNUMBER(G179),G179*0.000001,\"\")","v":""},{"$f":"IF(ISNUMBER($J$6),$J$6,\"\")","v":29.4},null,{"$f":"IF(ISNUMBER(H179),H179*0.000001,\"\")","v":""},{"$f":"IF(ISNUMBER($J$6),$J$6,\"\")","v":29.4}]
[]
[null,{"$f":"CHOOSE(LJazyk,\"Nastavený čas:\",  \"Seleced time:\")","v":"Seleced time:"},null,{"$f":"IF(ISNUMBER(F194),IF(J469>1,J469,1/J469),\"\")","v":""},null,"Shutter"," C1","C2"," C1 1th"," C1 2nd"," C2 1th"," C2 2nd"]
[null,{"$f":"CHOOSE(LJazyk,\"Průměrné změřené hodnoty [μs]:\",  \"Average measured values [μs]:\")","v":"Average measured values [μs]:"},null,null,null,{"$f":"IF(COUNT(F472:F491)>0,AVERAGE(F472:F491),\"\")","v":""},"","","","","",""]
[null,{"$f":"CHOOSE(LJazyk,\"Průměrná rychlost běhu pláten [m/s]:\",  \"Average curtain running speed [m/s]:\")","v":"Average curtain running speed [m/s]:"},null,null,null," --",{"$f":"IF(ISNUMBER(G194),($J$6*0.001)/(G194*0.000001),\"\")","v":""},{"$f":"IF(ISNUMBER(H194),($J$6*0.001)/(H194*0.000001),\"\")","v":""},{"$f":"IF(ISNUMBER(I194),($J$6*0.001/2)/(I194*0.000001),\"\")","v":""},{"$f":"IF(ISNUMBER(J194),($J$6*0.001/2)/(J194*0.000001),\"\")","v":""},{"$f":"IF(ISNUMBER(K194),($J$6*0.001/2)/(K194*0.000001),\"\")","v":""},{"$f":"IF(ISNUMBER(L194),($J$6*0.001/2)/(L194*0.000001),\"\")","v":""},null,{"$f":"IF(COUNT(G195:L195)>=6,IF(OR(MAX(G195:H195)/MIN(G195:H195)>$N$11, MAX(I195,K195)/MIN(I195,K195)>$N$11, MAX(J195,L195)/MIN(J195,L195)>$N$11),\"Velký rozdíl\",\"OK\"),\"\")","v":""}]
[null,{"$f":"CHOOSE(LJazyk,\"Dílčí časové intervaly závěrky [μs]:\n(značení dle DIN 19 016 - 06.1983)\",\n\"Partial shutter speed intervals [μs]:\n(according to DIN 19 016 - 06.1983)\")","v":"Partial shutter speed intervals [μs]:\n(according to DIN 19 016 - 06.1983)"},null,null,null,"te1","te2","te3","t1","t2","t3","T"]
[null,null,null,null,null,{"$f":"IF(COUNT($F194:$L194)=7,G197+I194-K194,\"\")","v":""},{"$f":"IF(COUNT($F194:$L194)=7,F194,\"\")","v":""},{"$f":"IF(COUNT($F194:$L194)=7,G197-J194+L194,\"\")","v":""},{"$f":"IF(COUNT($F194:$L194)=7,G194,\"\")","v":""},{"$f":"IF(COUNT($F194:$L194)=7,L197-G194-H194,\"\")","v":""},{"$f":"IF(COUNT($F194:$L194)=7,H194,\"\")","v":""},{"$f":"IF(COUNT($F194:$L194)=7,(G194+H197+F197+H194)/2,\"\")","v":""}]
[null,{"$f":"CHOOSE(LJazyk,\"Šířka štěrbiny závěrky w [mm]:\",  \"Shutter slit width w [mm]:\")","v":"Shutter slit width w [mm]:"},null,null,null,null,{"$f":"CHOOSE(LJazyk,\"začátek běhu\",  \"beginning of run\")","v":"beginning of run"},null,{"$f":"CHOOSE(LJazyk,\"střed běhu\",  \"center of run\")","v":"center of run"},null,{"$f":"CHOOSE(LJazyk,\"konec běhu\",  \"end of run\")","v":"end of run"}]
[null,null,null,null,null,null,{"$f":"IF(ISNUMBER($L197),IF($J197<0,Sirka_sterbiny(G204:H206,J204:K206, $J$6, G194, H194, I194, K194, L194, L197, F197, H197, 1),CHOOSE(LJazyk,\"otevřeno celé okno\",  \"full window is open\")),\"\")","v":""},null,{"$f":"IF(ISNUMBER($L197),IF($J197<0,Sirka_sterbiny(G204:H206,J204:K206, $J$6, G194, H194, I194, K194, L194, L197, F197, H197, 2),CHOOSE(LJazyk,\"otevřeno celé okno\",  \"full window is open\")),\"\")","v":""},null,{"$f":"IF(ISNUMBER($L197),IF($J197<0,Sirka_sterbiny(G204:H206,J204:K206, $J$6, G194, H194, I194, K194, L194, L197, F197, H197, 3),CHOOSE(LJazyk,\"otevřeno celé okno\",  \"full window is open\")),\"\")","v":""}]
[null,{"$f":"CHOOSE(LJazyk,\"Výsledné hodnoty:\",  \"Resulting values:\")","v":"Resulting values:"},null,{"$f":"CHOOSE(LJazyk,\"φ změř. čas (střed okna)\",  \"φ meas. time (in center)\")","v":"φ meas. time (in center)"},null,null,{"$f":"CHOOSE(LJazyk,\"Odch. φ změř. času DIN19016\",  \"Dev. of φ meas. time DIN19016\")","v":"Dev. of φ meas. time DIN19016"},null,null,{"$f":"CHOOSE(LJazyk,\"Rozptyl dle DIN19016\",  \"Variance acc. to DIN19016\")","v":"Variance acc. to DIN19016"}]
[null,null,null,{"$f":"IF(ISNUMBER(F194),IF(F194/1000000>1,F194/1000000,1/(F194/1000000)),\"\")","v":""},null,null,{"$f":"IF(AND(ISNUMBER(D201),ISNUMBER(D193)),OdchZmerCasuDIN(1/J469,F194/1000000,\"%\"),\"\")","v":""},null,null,{"$f":"IF(AND(ISNUMBER(D201),ISNUMBER(D193)),StabilitaDIN_Vfmoto(F472:F491, 1/J469,F194/1000000),\"\")","v":""}]
[null,null,null,null,null,null,"1. plátno",null,null,"2. plátno"]
[null,"Vstupní oblasti pro fuňkci polynom",null,null,null,null,"čas [s]","vzd [mm]",null,"čas [s]","vzd [mm]"]
[null,null,null,null,null,null,0,0,null,0,0]
[null,null,null,null,null,null,{"$f":"IF(ISNUMBER(I194),I194*0.000001,\"\")","v":""},{"$f":"IF(ISNUMBER($J$6),$J$6/2,\"\")","v":14.7},null,{"$f":"IF(ISNUMBER(K194),K194*0.000001,\"\")","v":""},{"$f":"IF(ISNUMBER($J$6),$J$6/2,\"\")","v":14.7}]
[null,null,null,null,null,null,{"$f":"IF(ISNUMBER(G194),G194*0.000001,\"\")","v":""},{"$f":"IF(ISNUMBER($J$6),$J$6,\"\")","v":29.4},null,{"$f":"IF(ISNUMBER(H194),H194*0.000001,\"\")","v":""},{"$f":"IF(ISNUMBER($J$6),$J$6,\"\")","v":29.4}]
[]
[null,{"$f":"CHOOSE(LJazyk,\"Nastavený čas:\",  \"Seleced time:\")","v":"Seleced time:"},null,{"$f":"IF(ISNUMBER(F209),IF(J496>1,J496,1/J496),\"\")","v":""},null,"Shutter"," C1","C2"," C1 1th"," C1 2nd"," C2 1th"," C2 2nd"]
[null,{"$f":"CHOOSE(LJazyk,\"Průměrné změřené hodnoty [μs]:\",  \"Average measured values [μs]:\")","v":"Average measured values [μs]:"},null,null,null,{"$f":"IF(COUNT(F499:F518)>0,AVERAGE(F499:F518),\"\")","v":""},"","","","","",""]
[null,{"$f":"CHOOSE(LJazyk,\"Průměrná rychlost běhu pláten [m/s]:\",  \"Average curtain running speed [m/s]:\")","v":"Average curtain running speed [m/s]:"},null,null,null," --",{"$f":"IF(ISNUMBER(G209),($J$6*0.001)/(G209*0.000001),\"\")","v":""},{"$f":"IF(ISNUMBER(H209),($J$6*0.001)/(H209*0.000001),\"\")","v":""},{"$f":"IF(ISNUMBER(I209),($J$6*0.001/2)/(I209*0.000001),\"\")","v":""},{"$f":"IF(ISNUMBER(J209),($J$6*0.001/2)/(J209*0.000001),\"\")","v":""},{"$f":"IF(ISNUMBER(K209),($J$6*0.001/2)/(K209*0.000001),\"\")","v":""},{"$f":"IF(ISNUMBER(L209),($J$6*0.001/2)/(L209*0.000001),\"\")","v":""},null,{"$f":"IF(COUNT(G210:L210)>=6,IF(OR(MAX(G210:H210)/MIN(G210:H210)>$N$11, MAX(I210,K210)/MIN(I210,K210)>$N$11, MAX(J210,L210)/MIN(J210,L210)>$N$11),\"Velký rozdíl\",\"OK\"),\"\")","v":""}]
[null,{"$f":"CHOOSE(LJazyk,\"Dílčí časové intervaly závěrky [μs]:\n(značení dle DIN 19 016 - 06.1983)\",\n\"Partial shutter speed intervals [μs]:\n(according to DIN 19 016 - 06.1983)\")","v":"Partial shutter speed intervals [μs]:\n(according to DIN 19 016 - 06.1983)"},null,null,null,"te1","te2","te3","t1","t2","t3","T"]
[null,null,null,null,null,{"$f":"IF(COUNT($F209:$L209)=7,G212+I209-K209,\"\")","v":""},{"$f":"IF(COUNT($F209:$L209)=7,F209,\"\")","v":""},{"$f":"IF(COUNT($F209:$L209)=7,G212-J209+L209,\"\")","v":""},{"$f":"IF(COUNT($F209:$L209)=7,G209,\"\")","v":""},{"$f":"IF(COUNT($F209:$L209)=7,L212-G209-H209,\"\")","v":""},{"$f":"IF(COUNT($F209:$L209)=7,H209,\"\")","v":""},{"$f":"IF(COUNT($F209:$L209)=7,(G209+H212+F212+H209)/2,\"\")","v":""}]
[null,{"$f":"CHOOSE(LJazyk,\"Šířka štěrbiny závěrky w [mm]:\",  \"Shutter slit width w [mm]:\")","v":"Shutter slit width w [mm]:"},null,null,null,null,{"$f":"CHOOSE(LJazyk,\"začátek běhu\",  \"beginning of run\")","v":"beginning of run"},null,{"$f":"CHOOSE(LJazyk,\"střed běhu\",  \"center of run\")","v":"center of run"},null,{"$f":"CHOOSE(LJazyk,\"konec běhu\",  \"end of run\")","v":"end of run"}]
[null,null,null,null,null,null,{"$f":"IF(ISNUMBER($L212),IF($J212<0,Sirka_sterbiny(G219:H221,J219:K221, $J$6, G209, H209, I209, K209, L209, L212, F212, H212, 1),CHOOSE(LJazyk,\"otevřeno celé okno\",  \"full window is open\")),\"\")","v":""},null,{"$f":"IF(ISNUMBER($L212),IF($J212<0,Sirka_sterbiny(G219:H221,J219:K221, $J$6, G209, H209, I209, K209, L209, L212, F212, H212, 2),CHOOSE(LJazyk,\"otevřeno celé okno\",  \"full window is open\")),\"\")","v":""},null,{"$f":"IF(ISNUMBER($L212),IF($J212<0,Sirka_sterbiny(G219:H221,J219:K221, $J$6, G209, H209, I209, K209, L209, L212, F212, H212, 3),CHOOSE(LJazyk,\"otevřeno celé okno\",  \"full window is open\")),\"\")","v":""}]
[null,{"$f":"CHOOSE(LJazyk,\"Výsledné hodnoty:\",  \"Resulting values:\")","v":"Resulting values:"},null,{"$f":"CHOOSE(LJazyk,\"φ změř. čas (střed okna)\",  \"φ meas. time (in center)\")","v":"φ meas. time (in center)"},null,null,{"$f":"CHOOSE(LJazyk,\"Odch. φ změř. času DIN19016\",  \"Dev. of φ meas. time DIN19016\")","v":"Dev. of φ meas. time DIN19016"},null,null,{"$f":"CHOOSE(LJazyk,\"Rozptyl dle DIN19016\",  \"Variance acc. to DIN19016\")","v":"Variance acc. to DIN19016"}]
[null,null,null,{"$f":"IF(ISNUMBER(F209),IF(F209/1000000>1,F209/1000000,1/(F209/1000000)),\"\")","v":""},null,null,{"$f":"IF(AND(ISNUMBER(D216),ISNUMBER(D208)),OdchZmerCasuDIN(1/J496,F209/1000000,\"%\"),\"\")","v":""},null,null,{"$f":"IF(AND(ISNUMBER(D216),ISNUMBER(D208)),StabilitaDIN_Vfmoto(F499:F518, 1/J496,F209/1000000),\"\")","v":""}]
[null,null,null,null,null,null,"1. plátno",null,null,"2. plátno"]
[null,"Vstupní oblasti pro fuňkci polynom",null,null,null,null,"čas [s]","vzd [mm]",null,"čas [s]","vzd [mm]"]
[null,null,null,null,null,null,0,0,null,0,0]
[null,null,null,null,null,null,{"$f":"IF(ISNUMBER(I209),I209*0.000001,\"\")","v":""},{"$f":"IF(ISNUMBER($J$6),$J$6/2,\"\")","v":14.7},null,{"$f":"IF(ISNUMBER(K209),K209*0.000001,\"\")","v":""},{"$f":"IF(ISNUMBER($J$6),$J$6/2,\"\")","v":14.7}]
[null,null,null,null,null,null,{"$f":"IF(ISNUMBER(G209),G209*0.000001,\"\")","v":""},{"$f":"IF(ISNUMBER($J$6),$J$6,\"\")","v":29.4},null,{"$f":"IF(ISNUMBER(H209),H209*0.000001,\"\")","v":""},{"$f":"IF(ISNUMBER($J$6),$J$6,\"\")","v":29.4}]
[]
[null,{"$f":"CHOOSE(LJazyk,\"Nastavený čas:\",  \"Seleced time:\")","v":"Seleced time:"},null,{"$f":"IF(ISNUMBER(F224),IF(J523>1,J523,1/J523),\"\")","v":""},null,"Shutter"," C1","C2"," C1 1th"," C1 2nd"," C2 1th"," C2 2nd"]
[null,{"$f":"CHOOSE(LJazyk,\"Průměrné změřené hodnoty [μs]:\",  \"Average measured values [μs]:\")","v":"Average measured values [μs]:"},null,null,null,{"$f":"IF(COUNT(F526:F545)>0,AVERAGE(F526:F545),\"\")","v":""},"","","","","",""]
[null,{"$f":"CHOOSE(LJazyk,\"Průměrná rychlost běhu pláten [m/s]:\",  \"Average curtain running speed [m/s]:\")","v":"Average curtain running speed [m/s]:"},null,null,null," --",{"$f":"IF(ISNUMBER(G224),($J$6*0.001)/(G224*0.000001),\"\")","v":""},{"$f":"IF(ISNUMBER(H224),($J$6*0.001)/(H224*0.000001),\"\")","v":""},{"$f":"IF(ISNUMBER(I224),($J$6*0.001/2)/(I224*0.000001),\"\")","v":""},{"$f":"IF(ISNUMBER(J224),($J$6*0.001/2)/(J224*0.000001),\"\")","v":""},{"$f":"IF(ISNUMBER(K224),($J$6*0.001/2)/(K224*0.000001),\"\")","v":""},{"$f":"IF(ISNUMBER(L224),($J$6*0.001/2)/(L224*0.000001),\"\")","v":""},null,{"$f":"IF(COUNT(G225:L225)>=6,IF(OR(MAX(G225:H225)/MIN(G225:H225)>$N$11, MAX(I225,K225)/MIN(I225,K225)>$N$11, MAX(J225,L225)/MIN(J225,L225)>$N$11),\"Velký rozdíl\",\"OK\"),\"\")","v":""}]
[null,{"$f":"CHOOSE(LJazyk,\"Dílčí časové intervaly závěrky [μs]:\n(značení dle DIN 19 016 - 06.1983)\",\n\"Partial shutter speed intervals [μs]:\n(according to DIN 19 016 - 06.1983)\")","v":"Partial shutter speed intervals [μs]:\n(according to DIN 19 016 - 06.1983)"},null,null,null,"te1","te2","te3","t1","t2","t3","T"]
[null,null,null,null,null,{"$f":"IF(COUNT($F224:$L224)=7,G227+I224-K224,\"\")","v":""},{"$f":"IF(COUNT($F224:$L224)=7,F224,\"\")","v":""},{"$f":"IF(COUNT($F224:$L224)=7,G227-J224+L224,\"\")","v":""},{"$f":"IF(COUNT($F224:$L224)=7,G224,\"\")","v":""},{"$f":"IF(COUNT($F224:$L224)=7,L227-G224-H224,\"\")","v":""},{"$f":"IF(COUNT($F224:$L224)=7,H224,\"\")","v":""},{"$f":"IF(COUNT($F224:$L224)=7,(G224+H227+F227+H224)/2,\"\")","v":""}]
[null,{"$f":"CHOOSE(LJazyk,\"Šířka štěrbiny závěrky w [mm]:\",  \"Shutter slit width w [mm]:\")","v":"Shutter slit width w [mm]:"},null,null,null,null,{"$f":"CHOOSE(LJazyk,\"začátek běhu\",  \"beginning of run\")","v":"beginning of run"},null,{"$f":"CHOOSE(LJazyk,\"střed běhu\",  \"center of run\")","v":"center of run"},null,{"$f":"CHOOSE(LJazyk,\"konec běhu\",  \"end of run\")","v":"end of run"}]
[null,null,null,null,null,null,{"$f":"IF(ISNUMBER($L227),IF($J227<0,Sirka_sterbiny(G234:H236,J234:K236, $J$6, G224, H224, I224, K224, L224, L227, F227, H227, 1),CHOOSE(LJazyk,\"otevřeno celé okno\",  \"full window is open\")),\"\")","v":""},null,{"$f":"IF(ISNUMBER($L227),IF($J227<0,Sirka_sterbiny(G234:H236,J234:K236, $J$6, G224, H224, I224, K224, L224, L227, F227, H227, 2),CHOOSE(LJazyk,\"otevřeno celé okno\",  \"full window is open\")),\"\")","v":""},null,{"$f":"IF(ISNUMBER($L227),IF($J227<0,Sirka_sterbiny(G234:H236,J234:K236, $J$6, G224, H224, I224, K224, L224, L227, F227, H227, 3),CHOOSE(LJazyk,\"otevřeno celé okno\",  \"full window is open\")),\"\")","v":""}]
[null,{"$f":"CHOOSE(LJazyk,\"Výsledné hodnoty:\",  \"Resulting values:\")","v":"Resulting values:"},null,{"$f":"CHOOSE(LJazyk,\"φ změř. čas (střed okna)\",  \"φ meas. time (in center)\")","v":"φ meas. time (in center)"},null,null,{"$f":"CHOOSE(LJazyk,\"Odch. φ změř. času DIN19016\",  \"Dev. of φ meas. time DIN19016\")","v":"Dev. of φ meas. time DIN19016"},null,null,{"$f":"CHOOSE(LJazyk,\"Rozptyl dle DIN19016\",  \"Variance acc. to DIN19016\")","v":"Variance acc. to DIN19016"}]
[null,null,null,{"$f":"IF(ISNUMBER(F224),IF(F224/1000000>1,F224/1000000,1/(F224/1000000)),\"\")","v":""},null,null,{"$f":"IF(AND(ISNUMBER(D231),ISNUMBER(D223)),OdchZmerCasuDIN(1/J523,F224/1000000,\"%\"),\"\")","v":""},null,null,{"$f":"IF(AND(ISNUMBER(D231),ISNUMBER(D223)),StabilitaDIN_Vfmoto(F526:F545, 1/J523,F224/1000000),\"\")","v":""}]
[null,null,null,null,null,null,"1. plátno",null,null,"2. plátno"]
[null,"Vstupní oblasti pro fuňkci polynom",null,null,null,null,"čas [s]","vzd [mm]",null,"čas [s]","vzd [mm]"]
[null,null,null,null,null,null,0,0,null,0,0]
[null,null,null,null,null,null,{"$f":"IF(ISNUMBER(I224),I224*0.000001,\"\")","v":""},{"$f":"IF(ISNUMBER($J$6),$J$6/2,\"\")","v":14.7},null,{"$f":"IF(ISNUMBER(K224),K224*0.000001,\"\")","v":""},{"$f":"IF(ISNUMBER($J$6),$J$6/2,\"\")","v":14.7}]
[null,null,null,null,null,null,{"$f":"IF(ISNUMBER(G224),G224*0.000001,\"\")","v":""},{"$f":"IF(ISNUMBER($J$6),$J$6,\"\")","v":29.4},null,{"$f":"IF(ISNUMBER(H224),H224*0.000001,\"\")","v":""},{"$f":"IF(ISNUMBER($J$6),$J$6,\"\")","v":29.4}]
[]
[null,{"$f":"CHOOSE(LJazyk,\"Nastavený čas:\",  \"Seleced time:\")","v":"Seleced time:"},null,{"$f":"IF(ISNUMBER(F239),IF(J550>1,J550,1/J550),\"\")","v":""},null,"Shutter"," C1","C2"," C1 1th"," C1 2nd"," C2 1th"," C2 2nd"]
[null,{"$f":"CHOOSE(LJazyk,\"Průměrné změřené hodnoty [μs]:\",  \"Average measured values [μs]:\")","v":"Average measured values [μs]:"},null,null,null,{"$f":"IF(COUNT(F553:F572)>0,AVERAGE(F553:F572),\"\")","v":""},"","","","","",""]
[null,{"$f":"CHOOSE(LJazyk,\"Průměrná rychlost běhu pláten [m/s]:\",  \"Average curtain running speed [m/s]:\")","v":"Average curtain running speed [m/s]:"},null,null,null," --",{"$f":"IF(ISNUMBER(G239),($J$6*0.001)/(G239*0.000001),\"\")","v":""},{"$f":"IF(ISNUMBER(H239),($J$6*0.001)/(H239*0.000001),\"\")","v":""},{"$f":"IF(ISNUMBER(I239),($J$6*0.001/2)/(I239*0.000001),\"\")","v":""},{"$f":"IF(ISNUMBER(J239),($J$6*0.001/2)/(J239*0.000001),\"\")","v":""},{"$f":"IF(ISNUMBER(K239),($J$6*0.001/2)/(K239*0.000001),\"\")","v":""},{"$f":"IF(ISNUMBER(L239),($J$6*0.001/2)/(L239*0.000001),\"\")","v":""},null,{"$f":"IF(COUNT(G240:L240)>=6,IF(OR(MAX(G240:H240)/MIN(G240:H240)>$N$11, MAX(I240,K240)/MIN(I240,K240)>$N$11, MAX(J240,L240)/MIN(J240,L240)>$N$11),\"Velký rozdíl\",\"OK\"),\"\")","v":""}]
[null,{"$f":"CHOOSE(LJazyk,\"Dílčí časové intervaly závěrky [μs]:\n(značení dle DIN 19 016 - 06.1983)\",\n\"Partial shutter speed intervals [μs]:\n(according to DIN 19 016 - 06.1983)\")","v":"Partial shutter speed intervals [μs]:\n(according to DIN 19 016 - 06.1983)"},null,null,null,"te1","te2","te3","t1","t2","t3","T"]
[null,null,null,null,null,{"$f":"IF(COUNT($F239:$L239)=7,G242+I239-K239,\"\")","v":""},{"$f":"IF(COUNT($F239:$L239)=7,F239,\"\")","v":""},{"$f":"IF(COUNT($F239:$L239)=7,G242-J239+L239,\"\")","v":""},{"$f":"IF(COUNT($F239:$L239)=7,G239,\"\")","v":""},{"$f":"IF(COUNT($F239:$L239)=7,L242-G239-H239,\"\")","v":""},{"$f":"IF(COUNT($F239:$L239)=7,H239,\"\")","v":""},{"$f":"IF(COUNT($F239:$L239)=7,(G239+H242+F242+H239)/2,\"\")","v":""}]
[null,{"$f":"CHOOSE(LJazyk,\"Šířka štěrbiny závěrky w [mm]:\",  \"Shutter slit width w [mm]:\")","v":"Shutter slit width w [mm]:"},null,null,null,null,{"$f":"CHOOSE(LJazyk,\"začátek běhu\",  \"beginning of run\")","v":"beginning of run"},null,{"$f":"CHOOSE(LJazyk,\"střed běhu\",  \"center of run\")","v":"center of run"},null,{"$f":"CHOOSE(LJazyk,\"konec běhu\",  \"end of run\")","v":"end of run"}]
[null,null,null,null,null,null,{"$f":"IF(ISNUMBER($L242),IF($J242<0,Sirka_sterbiny(G249:H251,J249:K251, $J$6, G239, H239, I239, K239, L239, L242, F242, H242, 1),CHOOSE(LJazyk,\"otevřeno celé okno\",  \"full window is open\")),\"\")","v":""},null,{"$f":"IF(ISNUMBER($L242),IF($J242<0,Sirka_sterbiny(G249:H251,J249:K251, $J$6, G239, H239, I239, K239, L239, L242, F242, H242, 2),CHOOSE(LJazyk,\"otevřeno celé okno\",  \"full window is open\")),\"\")","v":""},null,{"$f":"IF(ISNUMBER($L242),IF($J242<0,Sirka_sterbiny(G249:H251,J249:K251, $J$6, G239, H239, I239, K239, L239, L242, F242, H242, 3),CHOOSE(LJazyk,\"otevřeno celé okno\",  \"full window is open\")),\"\")","v":""}]
[null,{"$f":"CHOOSE(LJazyk,\"Výsledné hodnoty:\",  \"Resulting values:\")","v":"Resulting values:"},null,{"$f":"CHOOSE(LJazyk,\"φ změř. čas (střed okna)\",  \"φ meas. time (in center)\")","v":"φ meas. time (in center)"},null,null,{"$f":"CHOOSE(LJazyk,\"Odch. φ změř. času DIN19016\",  \"Dev. of φ meas. time DIN19016\")","v":"Dev. of φ meas. time DIN19016"},null,null,{"$f":"CHOOSE(LJazyk,\"Rozptyl dle DIN19016\",  \"Variance acc. to DIN19016\")","v":"Variance acc. to DIN19016"}]
[null,null,null,{"$f":"IF(ISNUMBER(F239),IF(F239/1000000>1,F239/1000000,1/(F239/1000000)),\"\")","v":""},null,null,{"$f":"IF(AND(ISNUMBER(D246),ISNUMBER(D238)),OdchZmerCasuDIN(1/J550,F239/1000000,\"%\"),\"\")","v":""},null,null,{"$f":"IF(AND(ISNUMBER(D246),ISNUMBER(D238)),StabilitaDIN_Vfmoto(F553:F572, 1/J550,F239/1000000),\"\")","v":""}]
[null,null,null,null,null,null,"1. plátno",null,null,"2. plátno"]
[null,"Vstupní oblasti pro fuňkci polynom",null,null,null,null,"čas [s]","vzd [mm]",null,"čas [s]","vzd [mm]"]
[null,null,null,null,null,null,0,0,null,0,0]
[null,null,null,null,null,null,{"$f":"IF(ISNUMBER(I239),I239*0.000001,\"\")","v":""},{"$f":"IF(ISNUMBER($J$6),$J$6/2,\"\")","v":14.7},null,{"$f":"IF(ISNUMBER(K239),K239*0.000001,\"\")","v":""},{"$f":"IF(ISNUMBER($J$6),$J$6/2,\"\")","v":14.7}]
[null,null,null,null,null,null,{"$f":"IF(ISNUMBER(G239),G239*0.000001,\"\")","v":""},{"$f":"IF(ISNUMBER($J$6),$J$6,\"\")","v":29.4},null,{"$f":"IF(ISNUMBER(H239),H239*0.000001,\"\")","v":""},{"$f":"IF(ISNUMBER($J$6),$J$6,\"\")","v":29.4}]
[]
[null,{"$f":"CHOOSE(LJazyk,\"Nastavený čas:\",  \"Seleced time:\")","v":"Seleced time:"},null,{"$f":"IF(ISNUMBER(F254),IF(J577>1,J577,1/J577),\"\")","v":""},null,"Shutter"," C1","C2"," C1 1th"," C1 2nd"," C2 1th"," C2 2nd"]
[null,{"$f":"CHOOSE(LJazyk,\"Průměrné změřené hodnoty [μs]:\",  \"Average measured values [μs]:\")","v":"Average measured values [μs]:"},null,null,null,{"$f":"IF(COUNT(F580:F599)>0,AVERAGE(F580:F599),\"\")","v":""},"","","","","",""]
[null,{"$f":"CHOOSE(LJazyk,\"Průměrná rychlost běhu pláten [m/s]:\",  \"Average curtain running speed [m/s]:\")","v":"Average curtain running speed [m/s]:"},null,null,null," --",{"$f":"IF(ISNUMBER(G254),($J$6*0.001)/(G254*0.000001),\"\")","v":""},{"$f":"IF(ISNUMBER(H254),($J$6*0.001)/(H254*0.000001),\"\")","v":""},{"$f":"IF(ISNUMBER(I254),($J$6*0.001/2)/(I254*0.000001),\"\")","v":""},{"$f":"IF(ISNUMBER(J254),($J$6*0.001/2)/(J254*0.000001),\"\")","v":""},{"$f":"IF(ISNUMBER(K254),($J$6*0.001/2)/(K254*0.000001),\"\")","v":""},{"$f":"IF(ISNUMBER(L254),($J$6*0.001/2)/(L254*0.000001),\"\")","v":""},null,{"$f":"IF(COUNT(G255:L255)>=6,IF(OR(MAX(G255:H255)/MIN(G255:H255)>$N$11, MAX(I255,K255)/MIN(I255,K255)>$N$11, MAX(J255,L255)/MIN(J255,L255)>$N$11),\"Velký rozdíl\",\"OK\"),\"\")","v":""}]
[null,{"$f":"CHOOSE(LJazyk,\"Dílčí časové intervaly závěrky [μs]:\n(značení dle DIN 19 016 - 06.1983)\",\n\"Partial shutter speed intervals [μs]:\n(according to DIN 19 016 - 06.1983)\")","v":"Partial shutter speed intervals [μs]:\n(according to DIN 19 016 - 06.1983)"},null,null,null,"te1","te2","te3","t1","t2","t3","T"]
[null,null,null,null,null,{"$f":"IF(COUNT($F254:$L254)=7,G257+I254-K254,\"\")","v":""},{"$f":"IF(COUNT($F254:$L254)=7,F254,\"\")","v":""},{"$f":"IF(COUNT($F254:$L254)=7,G257-J254+L254,\"\")","v":""},{"$f":"IF(COUNT($F254:$L254)=7,G254,\"\")","v":""},{"$f":"IF(COUNT($F254:$L254)=7,L257-G254-H254,\"\")","v":""},{"$f":"IF(COUNT($F254:$L254)=7,H254,\"\")","v":""},{"$f":"IF(COUNT($F254:$L254)=7,(G254+H257+F257+H254)/2,\"\")","v":""}]
[null,{"$f":"CHOOSE(LJazyk,\"Šířka štěrbiny závěrky w [mm]:\",  \"Shutter slit width w [mm]:\")","v":"Shutter slit width w [mm]:"},null,null,null,null,{"$f":"CHOOSE(LJazyk,\"začátek běhu\",  \"beginning of run\")","v":"beginning of run"},null,{"$f":"CHOOSE(LJazyk,\"střed běhu\",  \"center of run\")","v":"center of run"},null,{"$f":"CHOOSE(LJazyk,\"konec běhu\",  \"end of run\")","v":"end of run"}]
[null,null,null,null,null,null,{"$f":"IF(ISNUMBER($L257),IF($J257<0,Sirka_sterbiny(G264:H266,J264:K266, $J$6, G254, H254, I254, K254, L254, L257, F257, H257, 1),CHOOSE(LJazyk,\"otevřeno celé okno\",  \"full window is open\")),\"\")","v":""},null,{"$f":"IF(ISNUMBER($L257),IF($J257<0,Sirka_sterbiny(G264:H266,J264:K266, $J$6, G254, H254, I254, K254, L254, L257, F257, H257, 2),CHOOSE(LJazyk,\"otevřeno celé okno\",  \"full window is open\")),\"\")","v":""},null,{"$f":"IF(ISNUMBER($L257),IF($J257<0,Sirka_sterbiny(G264:H266,J264:K266, $J$6, G254, H254, I254, K254, L254, L257, F257, H257, 3),CHOOSE(LJazyk,\"otevřeno celé okno\",  \"full window is open\")),\"\")","v":""}]
[null,{"$f":"CHOOSE(LJazyk,\"Výsledné hodnoty:\",  \"Resulting values:\")","v":"Resulting values:"},null,{"$f":"CHOOSE(LJazyk,\"φ změř. čas (střed okna)\",  \"φ meas. time (in center)\")","v":"φ meas. time (in center)"},null,null,{"$f":"CHOOSE(LJazyk,\"Odch. φ změř. času DIN19016\",  \"Dev. of φ meas. time DIN19016\")","v":"Dev. of φ meas. time DIN19016"},null,null,{"$f":"CHOOSE(LJazyk,\"Rozptyl dle DIN19016\",  \"Variance acc. to DIN19016\")","v":"Variance acc. to DIN19016"}]
[null,null,null,{"$f":"IF(ISNUMBER(F254),IF(F254/1000000>1,F254/1000000,1/(F254/1000000)),\"\")","v":""},null,null,{"$f":"IF(AND(ISNUMBER(D261),ISNUMBER(D253)),OdchZmerCasuDIN(1/J577,F254/1000000,\"%\"),\"\")","v":""},null,null,{"$f":"IF(AND(ISNUMBER(D261),ISNUMBER(D253)),StabilitaDIN_Vfmoto(F580:F599, 1/J577,F254/1000000),\"\")","v":""}]
[null,null,null,null,null,null,"1. plátno",null,null,"2. plátno"]
[null,"Vstupní oblasti pro fuňkci polynom",null,null,null,null,"čas [s]","vzd [mm]",null,"čas [s]","vzd [mm]"]
[null,null,null,null,null,null,0,0,null,0,0]
[null,null,null,null,null,null,{"$f":"IF(ISNUMBER(I254),I254*0.000001,\"\")","v":""},{"$f":"IF(ISNUMBER($J$6),$J$6/2,\"\")","v":14.7},null,{"$f":"IF(ISNUMBER(K254),K254*0.000001,\"\")","v":""},{"$f":"IF(ISNUMBER($J$6),$J$6/2,\"\")","v":14.7}]
[null,null,null,null,null,null,{"$f":"IF(ISNUMBER(G254),G254*0.000001,\"\")","v":""},{"$f":"IF(ISNUMBER($J$6),$J$6,\"\")","v":29.4},null,{"$f":"IF(ISNUMBER(H254),H254*0.000001,\"\")","v":""},{"$f":"IF(ISNUMBER($J$6),$J$6,\"\")","v":29.4}]
[]
[null,{"$f":"CHOOSE(LJazyk,\"Nastavený čas:\",  \"Seleced time:\")","v":"Seleced time:"},null,{"$f":"IF(ISNUMBER(F269),IF(J604>1,J604,1/J604),\"\")","v":""},null,"Shutter"," C1","C2"," C1 1th"," C1 2nd"," C2 1th"," C2 2nd"]
[null,{"$f":"CHOOSE(LJazyk,\"Průměrné změřené hodnoty [μs]:\",  \"Average measured values [μs]:\")","v":"Average measured values [μs]:"},null,null,null,{"$f":"IF(COUNT(F607:F626)>0,AVERAGE(F607:F626),\"\")","v":""},"","","","","",""]
[null,{"$f":"CHOOSE(LJazyk,\"Průměrná rychlost běhu pláten [m/s]:\",  \"Average curtain running speed [m/s]:\")","v":"Average curtain running speed [m/s]:"},null,null,null," --",{"$f":"IF(ISNUMBER(G269),($J$6*0.001)/(G269*0.000001),\"\")","v":""},{"$f":"IF(ISNUMBER(H269),($J$6*0.001)/(H269*0.000001),\"\")","v":""},{"$f":"IF(ISNUMBER(I269),($J$6*0.001/2)/(I269*0.000001),\"\")","v":""},{"$f":"IF(ISNUMBER(J269),($J$6*0.001/2)/(J269*0.000001),\"\")","v":""},{"$f":"IF(ISNUMBER(K269),($J$6*0.001/2)/(K269*0.000001),\"\")","v":""},{"$f":"IF(ISNUMBER(L269),($J$6*0.001/2)/(L269*0.000001),\"\")","v":""},null,{"$f":"IF(COUNT(G270:L270)>=6,IF(OR(MAX(G270:H270)/MIN(G270:H270)>$N$11, MAX(I270,K270)/MIN(I270,K270)>$N$11, MAX(J270,L270)/MIN(J270,L270)>$N$11),\"Velký rozdíl\",\"OK\"),\"\")","v":""}]
[null,{"$f":"CHOOSE(LJazyk,\"Dílčí časové intervaly závěrky [μs]:\n(značení dle DIN 19 016 - 06.1983)\",\n\"Partial shutter speed intervals [μs]:\n(according to DIN 19 016 - 06.1983)\")","v":"Partial shutter speed intervals [μs]:\n(according to DIN 19 016 - 06.1983)"},null,null,null,"te1","te2","te3","t1","t2","t3","T"]
[null,null,null,null,null,{"$f":"IF(COUNT($F269:$L269)=7,G272+I269-K269,\"\")","v":""},{"$f":"IF(COUNT($F269:$L269)=7,F269,\"\")","v":""},{"$f":"IF(COUNT($F269:$L269)=7,G272-J269+L269,\"\")","v":""},{"$f":"IF(COUNT($F269:$L269)=7,G269,\"\")","v":""},{"$f":"IF(COUNT($F269:$L269)=7,L272-G269-H269,\"\")","v":""},{"$f":"IF(COUNT($F269:$L269)=7,H269,\"\")","v":""},{"$f":"IF(COUNT($F269:$L269)=7,(G269+H272+F272+H269)/2,\"\")","v":""}]
[null,{"$f":"CHOOSE(LJazyk,\"Šířka štěrbiny závěrky w [mm]:\",  \"Shutter slit width w [mm]:\")","v":"Shutter slit width w [mm]:"},null,null,null,null,{"$f":"CHOOSE(LJazyk,\"začátek běhu\",  \"beginning of run\")","v":"beginning of run"},null,{"$f":"CHOOSE(LJazyk,\"střed běhu\",  \"center of run\")","v":"center of run"},null,{"$f":"CHOOSE(LJazyk,\"konec běhu\",  \"end of run\")","v":"end of run"}]
[null,null,null,null,null,null,{"$f":"IF(ISNUMBER($L272),IF($J272<0,Sirka_sterbiny(G279:H281,J279:K281, $J$6, G269, H269, I269, K269, L269, L272, F272, H272, 1),CHOOSE(LJazyk,\"otevřeno celé okno\",  \"full window is open\")),\"\")","v":""},null,{"$f":"IF(ISNUMBER($L272),IF($J272<0,Sirka_sterbiny(G279:H281,J279:K281, $J$6, G269, H269, I269, K269, L269, L272, F272, H272, 2),CHOOSE(LJazyk,\"otevřeno celé okno\",  \"full window is open\")),\"\")","v":""},null,{"$f":"IF(ISNUMBER($L272),IF($J272<0,Sirka_sterbiny(G279:H281,J279:K281, $J$6, G269, H269, I269, K269, L269, L272, F272, H272, 3),CHOOSE(LJazyk,\"otevřeno celé okno\",  \"full window is open\")),\"\")","v":""}]
[null,{"$f":"CHOOSE(LJazyk,\"Výsledné hodnoty:\",  \"Resulting values:\")","v":"Resulting values:"},null,{"$f":"CHOOSE(LJazyk,\"φ změř. čas (střed okna)\",  \"φ meas. time (in center)\")","v":"φ meas. time (in center)"},null,null,{"$f":"CHOOSE(LJazyk,\"Odch. φ změř. času DIN19016\",  \"Dev. of φ meas. time DIN19016\")","v":"Dev. of φ meas. time DIN19016"},null,null,{"$f":"CHOOSE(LJazyk,\"Rozptyl dle DIN19016\",  \"Variance acc. to DIN19016\")","v":"Variance acc. to DIN19016"}]
[null,null,null,{"$f":"IF(ISNUMBER(F269),IF(F269/1000000>1,F269/1000000,1/(F269/1000000)),\"\")","v":""},null,null,{"$f":"IF(AND(ISNUMBER(D276),ISNUMBER(D268)),OdchZmerCasuDIN(1/J604,F269/1000000,\"%\"),\"\")","v":""},null,null,{"$f":"IF(AND(ISNUMBER(D276),ISNUMBER(D268)),StabilitaDIN_Vfmoto(F607:F626, 1/J604,F269/1000000),\"\")","v":""}]
[null,null,null,null,null,null,"1. plátno",null,null,"2. plátno"]
[null,"Vstupní oblasti pro fuňkci polynom",null,null,null,null,"čas [s]","vzd [mm]",null,"čas [s]","vzd [mm]"]
[null,null,null,null,null,null,0,0,null,0,0]
[null,null,null,null,null,null,{"$f":"IF(ISNUMBER(I269),I269*0.000001,\"\")","v":""},{"$f":"IF(ISNUMBER($J$6),$J$6/2,\"\")","v":14.7},null,{"$f":"IF(ISNUMBER(K269),K269*0.000001,\"\")","v":""},{"$f":"IF(ISNUMBER($J$6),$J$6/2,\"\")","v":14.7}]
[null,null,null,null,null,null,{"$f":"IF(ISNUMBER(G269),G269*0.000001,\"\")","v":""},{"$f":"IF(ISNUMBER($J$6),$J$6,\"\")","v":29.4},null,{"$f":"IF(ISNUMBER(H269),H269*0.000001,\"\")","v":""},{"$f":"IF(ISNUMBER($J$6),$J$6,\"\")","v":29.4}]
[]
[null,{"$f":"CHOOSE(LJazyk,\"Nastavený čas:\",  \"Seleced time:\")","v":"Seleced time:"},null,{"$f":"IF(ISNUMBER(F284),IF(J631>1,J631,1/J631),\"\")","v":""},null,"Shutter"," C1","C2"," C1 1th"," C1 2nd"," C2 1th"," C2 2nd"]
[null,{"$f":"CHOOSE(LJazyk,\"Průměrné změřené hodnoty [μs]:\",  \"Average measured values [μs]:\")","v":"Average measured values [μs]:"},null,null,null,{"$f":"IF(COUNT(F634:F653)>0,AVERAGE(F634:F653),\"\")","v":""},"","","","","",""]
[null,{"$f":"CHOOSE(LJazyk,\"Průměrná rychlost běhu pláten [m/s]:\",  \"Average curtain running speed [m/s]:\")","v":"Average curtain running speed [m/s]:"},null,null,null," --",{"$f":"IF(ISNUMBER(G284),($J$6*0.001)/(G284*0.000001),\"\")","v":""},{"$f":"IF(ISNUMBER(H284),($J$6*0.001)/(H284*0.000001),\"\")","v":""},{"$f":"IF(ISNUMBER(I284),($J$6*0.001/2)/(I284*0.000001),\"\")","v":""},{"$f":"IF(ISNUMBER(J284),($J$6*0.001/2)/(J284*0.000001),\"\")","v":""},{"$f":"IF(ISNUMBER(K284),($J$6*0.001/2)/(K284*0.000001),\"\")","v":""},{"$f":"IF(ISNUMBER(L284),($J$6*0.001/2)/(L284*0.000001),\"\")","v":""},null,{"$f":"IF(COUNT(G285:L285)>=6,IF(OR(MAX(G285:H285)/MIN(G285:H285)>$N$11, MAX(I285,K285)/MIN(I285,K285)>$N$11, MAX(J285,L285)/MIN(J285,L285)>$N$11),\"Velký rozdíl\",\"OK\"),\"\")","v":""}]
[null,{"$f":"CHOOSE(LJazyk,\"Dílčí časové intervaly závěrky [μs]:\n(značení dle DIN 19 016 - 06.1983)\",\n\"Partial shutter speed intervals [μs]:\n(according to DIN 19 016 - 06.1983)\")","v":"Partial shutter speed intervals [μs]:\n(according to DIN 19 016 - 06.1983)"},null,null,null,"te1","te2","te3","t1","t2","t3","T"]
[null,null,null,null,null,{"$f":"IF(COUNT($F284:$L284)=7,G287+I284-K284,\"\")","v":""},{"$f":"IF(COUNT($F284:$L284)=7,F284,\"\")","v":""},{"$f":"IF(COUNT($F284:$L284)=7,G287-J284+L284,\"\")","v":""},{"$f":"IF(COUNT($F284:$L284)=7,G284,\"\")","v":""},{"$f":"IF(COUNT($F284:$L284)=7,L287-G284-H284,\"\")","v":""},{"$f":"IF(COUNT($F284:$L284)=7,H284,\"\")","v":""},{"$f":"IF(COUNT($F284:$L284)=7,(G284+H287+F287+H284)/2,\"\")","v":""}]
[null,{"$f":"CHOOSE(LJazyk,\"Šířka štěrbiny závěrky w [mm]:\",  \"Shutter slit width w [mm]:\")","v":"Shutter slit width w [mm]:"},null,null,null,null,{"$f":"CHOOSE(LJazyk,\"začátek běhu\",  \"beginning of run\")","v":"beginning of run"},null,{"$f":"CHOOSE(LJazyk,\"střed běhu\",  \"center of run\")","v":"center of run"},null,{"$f":"CHOOSE(LJazyk,\"konec běhu\",  \"end of run\")","v":"end of run"}]
[null,null,null,null,null,null,{"$f":"IF(ISNUMBER($L287),IF($J287<0,Sirka_sterbiny(G294:H296,J294:K296, $J$6, G284, H284, I284, K284, L284, L287, F287, H287, 1),CHOOSE(LJazyk,\"otevřeno celé okno\",  \"full window is open\")),\"\")","v":""},null,{"$f":"IF(ISNUMBER($L287),IF($J287<0,Sirka_sterbiny(G294:H296,J294:K296, $J$6, G284, H284, I284, K284, L284, L287, F287, H287, 2),CHOOSE(LJazyk,\"otevřeno celé okno\",  \"full window is open\")),\"\")","v":""},null,{"$f":"IF(ISNUMBER($L287),IF($J287<0,Sirka_sterbiny(G294:H296,J294:K296, $J$6, G284, H284, I284, K284, L284, L287, F287, H287, 3),CHOOSE(LJazyk,\"otevřeno celé okno\",  \"full window is open\")),\"\")","v":""}]
[null,{"$f":"CHOOSE(LJazyk,\"Výsledné hodnoty:\",  \"Resulting values:\")","v":"Resulting values:"},null,{"$f":"CHOOSE(LJazyk,\"φ změř. čas (střed okna)\",  \"φ meas. time (in center)\")","v":"φ meas. time (in center)"},null,null,{"$f":"CHOOSE(LJazyk,\"Odch. φ změř. času DIN19016\",  \"Dev. of φ meas. time DIN19016\")","v":"Dev. of φ meas. time DIN19016"},null,null,{"$f":"CHOOSE(LJazyk,\"Rozptyl dle DIN19016\",  \"Variance acc. to DIN19016\")","v":"Variance acc. to DIN19016"}]
[null,null,null,{"$f":"IF(ISNUMBER(F284),IF(F284/1000000>1,F284/1000000,1/(F284/1000000)),\"\")","v":""},null,null,{"$f":"IF(AND(ISNUMBER(D291),ISNUMBER(D283)),OdchZmerCasuDIN(1/J631,F284/1000000,\"%\"),\"\")","v":""},null,null,{"$f":"IF(AND(ISNUMBER(D291),ISNUMBER(D283)),StabilitaDIN_Vfmoto(F634:F653, 1/J631,F284/1000000),\"\")","v":""}]
[null,null,null,null,null,null,"1. plátno",null,null,"2. plátno"]
[null,"Vstupní oblasti pro fuňkci polynom",null,null,null,null,"čas [s]","vzd [mm]",null,"čas [s]","vzd [mm]"]
[null,null,null,null,null,null,0,0,null,0,0]
[null,null,null,null,null,null,{"$f":"IF(ISNUMBER(I284),I284*0.000001,\"\")","v":""},{"$f":"IF(ISNUMBER($J$6),$J$6/2,\"\")","v":14.7},null,{"$f":"IF(ISNUMBER(K284),K284*0.000001,\"\")","v":""},{"$f":"IF(ISNUMBER($J$6),$J$6/2,\"\")","v":14.7}]
[null,null,null,null,null,null,{"$f":"IF(ISNUMBER(G284),G284*0.000001,\"\")","v":""},{"$f":"IF(ISNUMBER($J$6),$J$6,\"\")","v":29.4},null,{"$f":"IF(ISNUMBER(H284),H284*0.000001,\"\")","v":""},{"$f":"IF(ISNUMBER($J$6),$J$6,\"\")","v":29.4}]
[]
[null,{"$f":"CHOOSE(LJazyk,\"Nastavený čas:\",  \"Seleced time:\")","v":"Seleced time:"},null,{"$f":"IF(ISNUMBER(F299),IF(J658>1,J658,1/J658),\"\")","v":""},null,"Shutter"," C1","C2"," C1 1th"," C1 2nd"," C2 1th"," C2 2nd"]
[null,{"$f":"CHOOSE(LJazyk,\"Průměrné změřené hodnoty [μs]:\",  \"Average measured values [μs]:\")","v":"Average measured values [μs]:"},null,null,null,{"$f":"IF(COUNT(F661:F680)>0,AVERAGE(F661:F680),\"\")","v":""},"","","","","",""]
[null,{"$f":"CHOOSE(LJazyk,\"Průměrná rychlost běhu pláten [m/s]:\",  \"Average curtain running speed [m/s]:\")","v":"Average curtain running speed [m/s]:"},null,null,null," --",{"$f":"IF(ISNUMBER(G299),($J$6*0.001)/(G299*0.000001),\"\")","v":""},{"$f":"IF(ISNUMBER(H299),($J$6*0.001)/(H299*0.000001),\"\")","v":""},{"$f":"IF(ISNUMBER(I299),($J$6*0.001/2)/(I299*0.000001),\"\")","v":""},{"$f":"IF(ISNUMBER(J299),($J$6*0.001/2)/(J299*0.000001),\"\")","v":""},{"$f":"IF(ISNUMBER(K299),($J$6*0.001/2)/(K299*0.000001),\"\")","v":""},{"$f":"IF(ISNUMBER(L299),($J$6*0.001/2)/(L299*0.000001),\"\")","v":""},null,{"$f":"IF(COUNT(G300:L300)>=6,IF(OR(MAX(G300:H300)/MIN(G300:H300)>$N$11, MAX(I300,K300)/MIN(I300,K300)>$N$11, MAX(J300,L300)/MIN(J300,L300)>$N$11),\"Velký rozdíl\",\"OK\"),\"\")","v":""}]
[null,{"$f":"CHOOSE(LJazyk,\"Dílčí časové intervaly závěrky [μs]:\n(značení dle DIN 19 016 - 06.1983)\",\n\"Partial shutter speed intervals [μs]:\n(according to DIN 19 016 - 06.1983)\")","v":"Partial shutter speed intervals [μs]:\n(according to DIN 19 016 - 06.1983)"},null,null,null,"te1","te2","te3","t1","t2","t3","T"]
[null,null,null,null,null,{"$f":"IF(COUNT($F299:$L299)=7,G302+I299-K299,\"\")","v":""},{"$f":"IF(COUNT($F299:$L299)=7,F299,\"\")","v":""},{"$f":"IF(COUNT($F299:$L299)=7,G302-J299+L299,\"\")","v":""},{"$f":"IF(COUNT($F299:$L299)=7,G299,\"\")","v":""},{"$f":"IF(COUNT($F299:$L299)=7,L302-G299-H299,\"\")","v":""},{"$f":"IF(COUNT($F299:$L299)=7,H299,\"\")","v":""},{"$f":"IF(COUNT($F299:$L299)=7,(G299+H302+F302+H299)/2,\"\")","v":""}]
[null,{"$f":"CHOOSE(LJazyk,\"Šířka štěrbiny závěrky w [mm]:\",  \"Shutter slit width w [mm]:\")","v":"Shutter slit width w [mm]:"},null,null,null,null,{"$f":"CHOOSE(LJazyk,\"začátek běhu\",  \"beginning of run\")","v":"beginning of run"},null,{"$f":"CHOOSE(LJazyk,\"střed běhu\",  \"center of run\")","v":"center of run"},null,{"$f":"CHOOSE(LJazyk,\"konec běhu\",  \"end of run\")","v":"end of run"}]
[null,null,null,null,null,null,{"$f":"IF(ISNUMBER($L302),IF($J302<0,Sirka_sterbiny(G309:H311,J309:K311, $J$6, G299, H299, I299, K299, L299, L302, F302, H302, 1),CHOOSE(LJazyk,\"otevřeno celé okno\",  \"full window is open\")),\"\")","v":""},null,{"$f":"IF(ISNUMBER($L302),IF($J302<0,Sirka_sterbiny(G309:H311,J309:K311, $J$6, G299, H299, I299, K299, L299, L302, F302, H302, 2),CHOOSE(LJazyk,\"otevřeno celé okno\",  \"full window is open\")),\"\")","v":""},null,{"$f":"IF(ISNUMBER($L302),IF($J302<0,Sirka_sterbiny(G309:H311,J309:K311, $J$6, G299, H299, I299, K299, L299, L302, F302, H302, 3),CHOOSE(LJazyk,\"otevřeno celé okno\",  \"full window is open\")),\"\")","v":""}]
[null,{"$f":"CHOOSE(LJazyk,\"Výsledné hodnoty:\",  \"Resulting values:\")","v":"Resulting values:"},null,{"$f":"CHOOSE(LJazyk,\"φ změř. čas (střed okna)\",  \"φ meas. time (in center)\")","v":"φ meas. time (in center)"},null,null,{"$f":"CHOOSE(LJazyk,\"Odch. φ změř. času DIN19016\",  \"Dev. of φ meas. time DIN19016\")","v":"Dev. of φ meas. time DIN19016"},null,null,{"$f":"CHOOSE(LJazyk,\"Rozptyl dle DIN19016\",  \"Variance acc. to DIN19016\")","v":"Variance acc. to DIN19016"}]
[null,null,null,{"$f":"IF(ISNUMBER(F299),IF(F299/1000000>1,F299/1000000,1/(F299/1000000)),\"\")","v":""},null,null,{"$f":"IF(AND(ISNUMBER(D306),ISNUMBER(D298)),OdchZmerCasuDIN(1/J658,F299/1000000,\"%\"),\"\")","v":""},null,null,{"$f":"IF(AND(ISNUMBER(D306),ISNUMBER(D298)),StabilitaDIN_Vfmoto(F661:F680, 1/J658,F299/1000000),\"\")","v":""}]
[null,null,null,null,null,null,"1. plátno",null,null,"2. plátno"]
[null,"Vstupní oblasti pro fuňkci polynom",null,null,null,null,"čas [s]","vzd [mm]",null,"čas [s]","vzd [mm]"]
[null,null,null,null,null,null,0,0,null,0,0]
[null,null,null,null,null,null,{"$f":"IF(ISNUMBER(I299),I299*0.000001,\"\")","v":""},{"$f":"IF(ISNUMBER($J$6),$J$6/2,\"\")","v":14.7},null,{"$f":"IF(ISNUMBER(K299),K299*0.000001,\"\")","v":""},{"$f":"IF(ISNUMBER($J$6),$J$6/2,\"\")","v":14.7}]
[null,null,null,null,null,null,{"$f":"IF(ISNUMBER(G299),G299*0.000001,\"\")","v":""},{"$f":"IF(ISNUMBER($J$6),$J$6,\"\")","v":29.4},null,{"$f":"IF(ISNUMBER(H299),H299*0.000001,\"\")","v":""},{"$f":"IF(ISNUMBER($J$6),$J$6,\"\")","v":29.4}]
[]
[null,{"$f":"CHOOSE(LJazyk,\"Nastavený čas:\",  \"Seleced time:\")","v":"Seleced time:"},null,{"$f":"IF(ISNUMBER(F314),IF(J685>1,J685,1/J685),\"\")","v":""},null,"Shutter"," C1","C2"," C1 1th"," C1 2nd"," C2 1th"," C2 2nd"]
[null,{"$f":"CHOOSE(LJazyk,\"Průměrné změřené hodnoty [μs]:\",  \"Average measured values [μs]:\")","v":"Average measured values [μs]:"},null,null,null,{"$f":"IF(COUNT(F688:F707)>0,AVERAGE(F688:F707),\"\")","v":""},"","","","","",""]
[null,{"$f":"CHOOSE(LJazyk,\"Průměrná rychlost běhu pláten [m/s]:\",  \"Average curtain running speed [m/s]:\")","v":"Average curtain running speed [m/s]:"},null,null,null," --",{"$f":"IF(ISNUMBER(G314),($J$6*0.001)/(G314*0.000001),\"\")","v":""},{"$f":"IF(ISNUMBER(H314),($J$6*0.001)/(H314*0.000001),\"\")","v":""},{"$f":"IF(ISNUMBER(I314),($J$6*0.001/2)/(I314*0.000001),\"\")","v":""},{"$f":"IF(ISNUMBER(J314),($J$6*0.001/2)/(J314*0.000001),\"\")","v":""},{"$f":"IF(ISNUMBER(K314),($J$6*0.001/2)/(K314*0.000001),\"\")","v":""},{"$f":"IF(ISNUMBER(L314),($J$6*0.001/2)/(L314*0.000001),\"\")","v":""},null,{"$f":"IF(COUNT(G315:L315)>=6,IF(OR(MAX(G315:H315)/MIN(G315:H315)>$N$11, MAX(I315,K315)/MIN(I315,K315)>$N$11, MAX(J315,L315)/MIN(J315,L315)>$N$11),\"Velký rozdíl\",\"OK\"),\"\")","v":""}]
[null,{"$f":"CHOOSE(LJazyk,\"Dílčí časové intervaly závěrky [μs]:\n(značení dle DIN 19 016 - 06.1983)\",\n\"Partial shutter speed intervals [μs]:\n(according to DIN 19 016 - 06.1983)\")","v":"Partial shutter speed intervals [μs]:\n(according to DIN 19 016 - 06.1983)"},null,null,null,"te1","te2","te3","t1","t2","t3","T"]
[null,null,null,null,null,{"$f":"IF(COUNT($F314:$L314)=7,G317+I314-K314,\"\")","v":""},{"$f":"IF(COUNT($F314:$L314)=7,F314,\"\")","v":""},{"$f":"IF(COUNT($F314:$L314)=7,G317-J314+L314,\"\")","v":""},{"$f":"IF(COUNT($F314:$L314)=7,G314,\"\")","v":""},{"$f":"IF(COUNT($F314:$L314)=7,L317-G314-H314,\"\")","v":""},{"$f":"IF(COUNT($F314:$L314)=7,H314,\"\")","v":""},{"$f":"IF(COUNT($F314:$L314)=7,(G314+H317+F317+H314)/2,\"\")","v":""}]
[null,{"$f":"CHOOSE(LJazyk,\"Šířka štěrbiny závěrky w [mm]:\",  \"Shutter slit width w [mm]:\")","v":"Shutter slit width w [mm]:"},null,null,null,null,{"$f":"CHOOSE(LJazyk,\"začátek běhu\",  \"beginning of run\")","v":"beginning of run"},null,{"$f":"CHOOSE(LJazyk,\"střed běhu\",  \"center of run\")","v":"center of run"},null,{"$f":"CHOOSE(LJazyk,\"konec běhu\",  \"end of run\")","v":"end of run"}]
[null,null,null,null,null,null,{"$f":"IF(ISNUMBER($L317),IF($J317<0,Sirka_sterbiny(G324:H326,J324:K326, $J$6, G314, H314, I314, K314, L314, L317, F317, H317, 1),CHOOSE(LJazyk,\"otevřeno celé okno\",  \"full window is open\")),\"\")","v":""},null,{"$f":"IF(ISNUMBER($L317),IF($J317<0,Sirka_sterbiny(G324:H326,J324:K326, $J$6, G314, H314, I314, K314, L314, L317, F317, H317, 2),CHOOSE(LJazyk,\"otevřeno celé okno\",  \"full window is open\")),\"\")","v":""},null,{"$f":"IF(ISNUMBER($L317),IF($J317<0,Sirka_sterbiny(G324:H326,J324:K326, $J$6, G314, H314, I314, K314, L314, L317, F317, H317, 3),CHOOSE(LJazyk,\"otevřeno celé okno\",  \"full window is open\")),\"\")","v":""}]
[null,{"$f":"CHOOSE(LJazyk,\"Výsledné hodnoty:\",  \"Resulting values:\")","v":"Resulting values:"},null,{"$f":"CHOOSE(LJazyk,\"φ změř. čas (střed okna)\",  \"φ meas. time (in center)\")","v":"φ meas. time (in center)"},null,null,{"$f":"CHOOSE(LJazyk,\"Odch. φ změř. času DIN19016\",  \"Dev. of φ meas. time DIN19016\")","v":"Dev. of φ meas. time DIN19016"},null,null,{"$f":"CHOOSE(LJazyk,\"Rozptyl dle DIN19016\",  \"Variance acc. to DIN19016\")","v":"Variance acc. to DIN19016"}]
[null,null,null,{"$f":"IF(ISNUMBER(F314),IF(F314/1000000>1,F314/1000000,1/(F314/1000000)),\"\")","v":""},null,null,{"$f":"IF(AND(ISNUMBER(D321),ISNUMBER(D313)),OdchZmerCasuDIN(1/J685,F314/1000000,\"%\"),\"\")","v":""},null,null,{"$f":"IF(AND(ISNUMBER(D321),ISNUMBER(D313)),StabilitaDIN_Vfmoto(F688:F707, 1/J685,F314/1000000),\"\")","v":""}]
[null,null,null,null,null,null,"1. plátno",null,null,"2. plátno"]
[null,"Vstupní oblasti pro fuňkci polynom",null,null,null,null,"čas [s]","vzd [mm]",null,"čas [s]","vzd [mm]"]
[null,null,null,null,null,null,0,0,null,0,0]
[null,null,null,null,null,null,{"$f":"IF(ISNUMBER(I314),I314*0.000001,\"\")","v":""},{"$f":"IF(ISNUMBER($J$6),$J$6/2,\"\")","v":14.7},null,{"$f":"IF(ISNUMBER(K314),K314*0.000001,\"\")","v":""},{"$f":"IF(ISNUMBER($J$6),$J$6/2,\"\")","v":14.7}]
[null,null,null,null,null,null,{"$f":"IF(ISNUMBER(G314),G314*0.000001,\"\")","v":""},{"$f":"IF(ISNUMBER($J$6),$J$6,\"\")","v":29.4},null,{"$f":"IF(ISNUMBER(H314),H314*0.000001,\"\")","v":""},{"$f":"IF(ISNUMBER($J$6),$J$6,\"\")","v":29.4}]
[]
[null,{"$f":"CHOOSE(LJazyk,\"Nastavený čas:\",  \"Seleced time:\")","v":"Seleced time:"},null,{"$f":"IF(ISNUMBER(F329),IF(J712>1,J712,1/J712),\"\")","v":""},null,"Shutter"," C1","C2"," C1 1th"," C1 2nd"," C2 1th"," C2 2nd"]
[null,{"$f":"CHOOSE(LJazyk,\"Průměrné změřené hodnoty [μs]:\",  \"Average measured values [μs]:\")","v":"Average measured values [μs]:"},null,null,null,{"$f":"IF(COUNT(F715:F734)>0,AVERAGE(F715:F734),\"\")","v":""},"","","","","",""]
[null,{"$f":"CHOOSE(LJazyk,\"Průměrná rychlost běhu pláten [m/s]:\",  \"Average curtain running speed [m/s]:\")","v":"Average curtain running speed [m/s]:"},null,null,null," --",{"$f":"IF(ISNUMBER(G329),($J$6*0.001)/(G329*0.000001),\"\")","v":""},{"$f":"IF(ISNUMBER(H329),($J$6*0.001)/(H329*0.000001),\"\")","v":""},{"$f":"IF(ISNUMBER(I329),($J$6*0.001/2)/(I329*0.000001),\"\")","v":""},{"$f":"IF(ISNUMBER(J329),($J$6*0.001/2)/(J329*0.000001),\"\")","v":""},{"$f":"IF(ISNUMBER(K329),($J$6*0.001/2)/(K329*0.000001),\"\")","v":""},{"$f":"IF(ISNUMBER(L329),($J$6*0.001/2)/(L329*0.000001),\"\")","v":""},null,{"$f":"IF(COUNT(G330:L330)>=6,IF(OR(MAX(G330:H330)/MIN(G330:H330)>$N$11, MAX(I330,K330)/MIN(I330,K330)>$N$11, MAX(J330,L330)/MIN(J330,L330)>$N$11),\"Velký rozdíl\",\"OK\"),\"\")","v":""}]
[null,{"$f":"CHOOSE(LJazyk,\"Dílčí časové intervaly závěrky [μs]:\n(značení dle DIN 19 016 - 06.1983)\",\n\"Partial shutter speed intervals [μs]:\n(according to DIN 19 016 - 06.1983)\")","v":"Partial shutter speed intervals [μs]:\n(according to DIN 19 016 - 06.1983)"},null,null,null,"te1","te2","te3","t1","t2","t3","T"]
[null,null,null,null,null,{"$f":"IF(COUNT($F329:$L329)=7,G332+I329-K329,\"\")","v":""},{"$f":"IF(COUNT($F329:$L329)=7,F329,\"\")","v":""},{"$f":"IF(COUNT($F329:$L329)=7,G332-J329+L329,\"\")","v":""},{"$f":"IF(COUNT($F329:$L329)=7,G329,\"\")","v":""},{"$f":"IF(COUNT($F329:$L329)=7,L332-G329-H329,\"\")","v":""},{"$f":"IF(COUNT($F329:$L329)=7,H329,\"\")","v":""},{"$f":"IF(COUNT($F329:$L329)=7,(G329+H332+F332+H329)/2,\"\")","v":""}]
[null,{"$f":"CHOOSE(LJazyk,\"Šířka štěrbiny závěrky w [mm]:\",  \"Shutter slit width w [mm]:\")","v":"Shutter slit width w [mm]:"},null,null,null,null,{"$f":"CHOOSE(LJazyk,\"začátek běhu\",  \"beginning of run\")","v":"beginning of run"},null,{"$f":"CHOOSE(LJazyk,\"střed běhu\",  \"center of run\")","v":"center of run"},null,{"$f":"CHOOSE(LJazyk,\"konec běhu\",  \"end of run\")","v":"end of run"}]
[null,null,null,null,null,null,{"$f":"IF(ISNUMBER($L332),IF($J332<0,Sirka_sterbiny(G339:H341,J339:K341, $J$6, G329, H329, I329, K329, L329, L332, F332, H332, 1),CHOOSE(LJazyk,\"otevřeno celé okno\",  \"full window is open\")),\"\")","v":""},null,{"$f":"IF(ISNUMBER($L332),IF($J332<0,Sirka_sterbiny(G339:H341,J339:K341, $J$6, G329, H329, I329, K329, L329, L332, F332, H332, 2),CHOOSE(LJazyk,\"otevřeno celé okno\",  \"full window is open\")),\"\")","v":""},null,{"$f":"IF(ISNUMBER($L332),IF($J332<0,Sirka_sterbiny(G339:H341,J339:K341, $J$6, G329, H329, I329, K329, L329, L332, F332, H332, 3),CHOOSE(LJazyk,\"otevřeno celé okno\",  \"full window is open\")),\"\")","v":""}]
[null,{"$f":"CHOOSE(LJazyk,\"Výsledné hodnoty:\",  \"Resulting values:\")","v":"Resulting values:"},null,{"$f":"CHOOSE(LJazyk,\"φ změř. čas (střed okna)\",  \"φ meas. time (in center)\")","v":"φ meas. time (in center)"},null,null,{"$f":"CHOOSE(LJazyk,\"Odch. φ změř. času DIN19016\",  \"Dev. of φ meas. time DIN19016\")","v":"Dev. of φ meas. time DIN19016"},null,null,{"$f":"CHOOSE(LJazyk,\"Rozptyl dle DIN19016\",  \"Variance acc. to DIN19016\")","v":"Variance acc. to DIN19016"}]
[null,null,null,{"$f":"IF(ISNUMBER(F329),IF(F329/1000000>1,F329/1000000,1/(F329/1000000)),\"\")","v":""},null,null,{"$f":"IF(AND(ISNUMBER(D336),ISNUMBER(D328)),OdchZmerCasuDIN(1/J712,F329/1000000,\"%\"),\"\")","v":""},null,null,{"$f":"IF(AND(ISNUMBER(D336),ISNUMBER(D328)),StabilitaDIN_Vfmoto(F715:F734, 1/J712,F329/1000000),\"\")","v":""}]
[null,null,null,null,null,null,"1. plátno",null,null,"2. plátno"]
[null,"Vstupní oblasti pro fuňkci polynom",null,null,null,null,"čas [s]","vzd [mm]",null,"čas [s]","vzd [mm]"]
[null,null,null,null,null,null,0,0,null,0,0]
[null,null,null,null,null,null,{"$f":"IF(ISNUMBER(I329),I329*0.000001,\"\")","v":""},{"$f":"IF(ISNUMBER($J$6),$J$6/2,\"\")","v":14.7},null,{"$f":"IF(ISNUMBER(K329),K329*0.000001,\"\")","v":""},{"$f":"IF(ISNUMBER($J$6),$J$6/2,\"\")","v":14.7}]
[null,null,null,null,null,null,{"$f":"IF(ISNUMBER(G329),G329*0.000001,\"\")","v":""},{"$f":"IF(ISNUMBER($J$6),$J$6,\"\")","v":29.4},null,{"$f":"IF(ISNUMBER(H329),H329*0.000001,\"\")","v":""},{"$f":"IF(ISNUMBER($J$6),$J$6,\"\")","v":29.4}]
[]
[null,{"$f":"CHOOSE(LJazyk,\"Nastavený čas:\",  \"Seleced time:\")","v":"Seleced time:"},null,{"$f":"IF(ISNUMBER(F344),IF(J739>1,J739,1/J739),\"\")","v":""},null,"Shutter"," C1","C2"," C1 1th"," C1 2nd"," C2 1th"," C2 2nd"]
[null,{"$f":"CHOOSE(LJazyk,\"Průměrné změřené hodnoty [μs]:\",  \"Average measured values [μs]:\")","v":"Average measured values [μs]:"},null,null,null,{"$f":"IF(COUNT(F742:F761)>0,AVERAGE(F742:F761),\"\")","v":""},"","","","","",""]
[null,{"$f":"CHOOSE(LJazyk,\"Průměrná rychlost běhu pláten [m/s]:\",  \"Average curtain running speed [m/s]:\")","v":"Average curtain running speed [m/s]:"},null,null,null," --",{"$f":"IF(ISNUMBER(G344),($J$6*0.001)/(G344*0.000001),\"\")","v":""},{"$f":"IF(ISNUMBER(H344),($J$6*0.001)/(H344*0.000001),\"\")","v":""},{"$f":"IF(ISNUMBER(I344),($J$6*0.001/2)/(I344*0.000001),\"\")","v":""},{"$f":"IF(ISNUMBER(J344),($J$6*0.001/2)/(J344*0.000001),\"\")","v":""},{"$f":"IF(ISNUMBER(K344),($J$6*0.001/2)/(K344*0.000001),\"\")","v":""},{"$f":"IF(ISNUMBER(L344),($J$6*0.001/2)/(L344*0.000001),\"\")","v":""},null,{"$f":"IF(COUNT(G345:L345)>=6,IF(OR(MAX(G345:H345)/MIN(G345:H345)>$N$11, MAX(I345,K345)/MIN(I345,K345)>$N$11, MAX(J345,L345)/MIN(J345,L345)>$N$11),\"Velký rozdíl\",\"OK\"),\"\")","v":""}]
[null,{"$f":"CHOOSE(LJazyk,\"Dílčí časové intervaly závěrky [μs]:\n(značení dle DIN 19 016 - 06.1983)\",\n\"Partial shutter speed intervals [μs]:\n(according to DIN 19 016 - 06.1983)\")","v":"Partial shutter speed intervals [μs]:\n(according to DIN 19 016 - 06.1983)"},null,null,null,"te1","te2","te3","t1","t2","t3","T"]
[null,null,null,null,null,{"$f":"IF(COUNT($F344:$L344)=7,G347+I344-K344,\"\")","v":""},{"$f":"IF(COUNT($F344:$L344)=7,F344,\"\")","v":""},{"$f":"IF(COUNT($F344:$L344)=7,G347-J344+L344,\"\")","v":""},{"$f":"IF(COUNT($F344:$L344)=7,G344,\"\")","v":""},{"$f":"IF(COUNT($F344:$L344)=7,L347-G344-H344,\"\")","v":""},{"$f":"IF(COUNT($F344:$L344)=7,H344,\"\")","v":""},{"$f":"IF(COUNT($F344:$L344)=7,(G344+H347+F347+H344)/2,\"\")","v":""}]
[null,{"$f":"CHOOSE(LJazyk,\"Šířka štěrbiny závěrky w [mm]:\",  \"Shutter slit width w [mm]:\")","v":"Shutter slit width w [mm]:"},null,null,null,null,{"$f":"CHOOSE(LJazyk,\"začátek běhu\",  \"beginning of run\")","v":"beginning of run"},null,{"$f":"CHOOSE(LJazyk,\"střed běhu\",  \"center of run\")","v":"center of run"},null,{"$f":"CHOOSE(LJazyk,\"konec běhu\",  \"end of run\")","v":"end of run"}]
[null,null,null,null,null,null,{"$f":"IF(ISNUMBER($L347),IF($J347<0,Sirka_sterbiny(G354:H356,J354:K356, $J$6, G344, H344, I344, K344, L344, L347, F347, H347, 1),CHOOSE(LJazyk,\"otevřeno celé okno\",  \"full window is open\")),\"\")","v":""},null,{"$f":"IF(ISNUMBER($L347),IF($J347<0,Sirka_sterbiny(G354:H356,J354:K356, $J$6, G344, H344, I344, K344, L344, L347, F347, H347, 2),CHOOSE(LJazyk,\"otevřeno celé okno\",  \"full window is open\")),\"\")","v":""},null,{"$f":"IF(ISNUMBER($L347),IF($J347<0,Sirka_sterbiny(G354:H356,J354:K356, $J$6, G344, H344, I344, K344, L344, L347, F347, H347, 3),CHOOSE(LJazyk,\"otevřeno celé okno\",  \"full window is open\")),\"\")","v":""}]
[null,{"$f":"CHOOSE(LJazyk,\"Výsledné hodnoty:\",  \"Resulting values:\")","v":"Resulting values:"},null,{"$f":"CHOOSE(LJazyk,\"φ změř. čas (střed okna)\",  \"φ meas. time (in center)\")","v":"φ meas. time (in center)"},null,null,{"$f":"CHOOSE(LJazyk,\"Odch. φ změř. času DIN19016\",  \"Dev. of φ meas. time DIN19016\")","v":"Dev. of φ meas. time DIN19016"},null,null,{"$f":"CHOOSE(LJazyk,\"Rozptyl dle DIN19016\",  \"Variance acc. to DIN19016\")","v":"Variance acc. to DIN19016"}]
[null,null,null,{"$f":"IF(ISNUMBER(F344),IF(F344/1000000>1,F344/1000000,1/(F344/1000000)),\"\")","v":""},null,null,{"$f":"IF(AND(ISNUMBER(D351),ISNUMBER(D343)),OdchZmerCasuDIN(1/J739,F344/1000000,\"%\"),\"\")","v":""},null,null,{"$f":"IF(AND(ISNUMBER(D351),ISNUMBER(D343)),StabilitaDIN_Vfmoto(F742:F761, 1/J739,F344/1000000),\"\")","v":""}]
[null,null,null,null,null,null,"1. plátno",null,null,"2. plátno"]
[null,"Vstupní oblasti pro fuňkci polynom",null,null,null,null,"čas [s]","vzd [mm]",null,"čas [s]","vzd [mm]"]
[null,null,null,null,null,null,0,0,null,0,0]
[null,null,null,null,null,null,{"$f":"IF(ISNUMBER(I344),I344*0.000001,\"\")","v":""},{"$f":"IF(ISNUMBER($J$6),$J$6/2,\"\")","v":14.7},null,{"$f":"IF(ISNUMBER(K344),K344*0.000001,\"\")","v":""},{"$f":"IF(ISNUMBER($J$6),$J$6/2,\"\")","v":14.7}]
[null,null,null,null,null,null,{"$f":"IF(ISNUMBER(G344),G344*0.000001,\"\")","v":""},{"$f":"IF(ISNUMBER($J$6),$J$6,\"\")","v":29.4},null,{"$f":"IF(ISNUMBER(H344),H344*0.000001,\"\")","v":""},{"$f":"IF(ISNUMBER($J$6),$J$6,\"\")","v":29.4}]
[]
[]
[null,{"$f":"CHOOSE(LJazyk,\"   Zadání pro 1. řádek výsledkové tabulky\",  \"   Input for 1st row of results table\")","v":"   Input for 1st row of results table"},null,null,null,null,null,{"$f":"IF(COUNT(G360,K360)>=2,CHOOSE(LJazyk,\"Zadat jen jeden čas !!\",  \"Enter only one time value !!\"),\"\")","v":""}]
[null,{"$f":"CHOOSE(LJazyk,\"  Nastavený čas, zadat jen jednou:\",  \"  Selected time, enter only once:\")","v":"  Selected time, enter only once:"},null,null,null,{"$f":"CHOOSE(LJazyk,\"buď\",  \"either\")","v":"either"},null,"s",{"$f":"CHOOSE(LJazyk,\"nebo\",  \"or\")","v":"or"},"1 /",null,"s"]
[null,null,null,null,null,null,null,null,null,{"$f":"IF(COUNT(G360,K360)>=2,\"\",IF(ISNUMBER(G360),1/G360,IF(ISNUMBER(K360),K360,\"\")))","v":""}]
[null,null,null,null,null,{"$f":"CHOOSE(LJazyk,\"Změřené hodnoty [μs]\",  \"Measured values [μs]\")","v":"Measured values [μs]"}]
[null,null,null,null,null,"Shutter"," C1","C2"," C1 1th"," C1 2nd"," C2 1th"," C2 2nd"]
[]
[]
[null,null,null,null,null,null,null,null,null,null,null,null,22]
[]
[]
[]
[]
[]
[]
[]
[]
[]
[]
[]
[]
[]
[]
[]
[]
[]
[]
[]
[null,{"$f":"CHOOSE(LJazyk,\"   Zadání pro 2. řádek výsledkové tabulky\",  \"   Input for 2nd row of results table\")","v":"   Input for 2nd row of results table"},null,null,null,null,null,{"$f":"IF(COUNT(G387,K387)>=2,CHOOSE(LJazyk,\"Zadat jen jeden čas !!\",  \"Enter only one time value !!\"),\"\")","v":""}]
[null,{"$f":"CHOOSE(LJazyk,\"  Nastavený čas, zadat jen jednou:\",  \"  Selected time, enter only once:\")","v":"  Selected time, enter only once:"},null,null,null,{"$f":"CHOOSE(LJazyk,\"buď\",  \"either\")","v":"either"},null,"s",{"$f":"CHOOSE(LJazyk,\"nebo\",  \"or\")","v":"or"},"1 /",null,"s"]
[null,null,null,null,null,null,null,null,null,{"$f":"IF(COUNT(G387,K387)>=2,\"\",IF(ISNUMBER(G387),1/G387,IF(ISNUMBER(K387),K387,\"\")))","v":""}]
[null,null,null,null,null,{"$f":"CHOOSE(LJazyk,\"Změřené hodnoty [μs]\",  \"Measured values [μs]\")","v":"Measured values [μs]"}]
[null,null,null,null,null,"Shutter"," C1","C2"," C1 1th"," C1 2nd"," C2 1th"," C2 2nd"]
[]
[]
[]
[]
[]
[]
[]
[]
[]
[]
[]
[]
[]
[]
[]
[]
[]
[]
[]
[]
[]
[]
[null,{"$f":"CHOOSE(LJazyk,\"   Zadání pro 3. řádek výsledkové tabulky\",  \"   Input for 3rd row of results table\")","v":"   Input for 3rd row of results table"},null,null,null,null,null,{"$f":"IF(COUNT(G414,K414)>=2,CHOOSE(LJazyk,\"Zadat jen jeden čas !!\",  \"Enter only one time value !!\"),\"\")","v":""}]
[null,{"$f":"CHOOSE(LJazyk,\"  Nastavený čas, zadat jen jednou:\",  \"  Selected time, enter only once:\")","v":"  Selected time, enter only once:"},null,null,null,{"$f":"CHOOSE(LJazyk,\"buď\",  \"either\")","v":"either"},null,"s",{"$f":"CHOOSE(LJazyk,\"nebo\",  \"or\")","v":"or"},"1 /",null,"s"]
[null,null,null,null,null,null,null,null,null,{"$f":"IF(COUNT(G414,K414)>=2,\"\",IF(ISNUMBER(G414),1/G414,IF(ISNUMBER(K414),K414,\"\")))","v":""}]
[null,null,null,null,null,{"$f":"CHOOSE(LJazyk,\"Změřené hodnoty [μs]\",  \"Measured values [μs]\")","v":"Measured values [μs]"}]
[null,null,null,null,null,"Shutter"," C1","C2"," C1 1th"," C1 2nd"," C2 1th"," C2 2nd"]
[]
[]
[]
[]
[]
[]
[]
[]
[]
[]
[]
[]
[]
[]
[]
[]
[]
[]
[]
[]
[]
[]
[null,{"$f":"CHOOSE(LJazyk,\"   Zadání pro 4. řádek výsledkové tabulky\",  \"   Input for 4th row of results table\")","v":"   Input for 4th row of results table"},null,null,null,null,null,{"$f":"IF(COUNT(G441,K441)>=2,CHOOSE(LJazyk,\"Zadat jen jeden čas !!\",  \"Enter only one time value !!\"),\"\")","v":""}]
[null,{"$f":"CHOOSE(LJazyk,\"  Nastavený čas, zadat jen jednou:\",  \"  Selected time, enter only once:\")","v":"  Selected time, enter only once:"},null,null,null,{"$f":"CHOOSE(LJazyk,\"buď\",  \"either\")","v":"either"},null,"s",{"$f":"CHOOSE(LJazyk,\"nebo\",  \"or\")","v":"or"},"1 /",null,"s"]
[null,null,null,null,null,null,null,null,null,{"$f":"IF(COUNT(G441,K441)>=2,\"\",IF(ISNUMBER(G441),1/G441,IF(ISNUMBER(K441),K441,\"\")))","v":""}]
[null,null,null,null,null,{"$f":"CHOOSE(LJazyk,\"Změřené hodnoty [μs]\",  \"Measured values [μs]\")","v":"Measured values [μs]"}]
[null,null,null,null,null,"Shutter"," C1","C2"," C1 1th"," C1 2nd"," C2 1th"," C2 2nd"]
[]
[]
[]
[]
[]
[]
[]
[]
[]
[]
[]
[]
[]
[]
[]
[]
[]
[]
[]
[]
[]
[]
[null,{"$f":"CHOOSE(LJazyk,\"   Zadání pro 5. řádek výsledkové tabulky\",  \"   Input for row 5 of results table\")","v":"   Input for row 5 of results table"},null,null,null,null,null,{"$f":"IF(COUNT(G468,K468)>=2,CHOOSE(LJazyk,\"Zadat jen jeden čas !!\",  \"Enter only one time value !!\"),\"\")","v":""}]
[null,{"$f":"CHOOSE(LJazyk,\"  Nastavený čas, zadat jen jednou:\",  \"  Selected time, enter only once:\")","v":"  Selected time, enter only once:"},null,null,null,{"$f":"CHOOSE(LJazyk,\"buď\",  \"either\")","v":"either"},null,"s",{"$f":"CHOOSE(LJazyk,\"nebo\",  \"or\")","v":"or"},"1 /",null,"s"]
[null,null,null,null,null,null,null,null,null,{"$f":"IF(COUNT(G468,K468)>=2,\"\",IF(ISNUMBER(G468),1/G468,IF(ISNUMBER(K468),K468,\"\")))","v":""}]
[null,null,null,null,null,{"$f":"CHOOSE(LJazyk,\"Změřené hodnoty [μs]\",  \"Measured values [μs]\")","v":"Measured values [μs]"}]
[null,null,null,null,null,"Shutter"," C1","C2"," C1 1th"," C1 2nd"," C2 1th"," C2 2nd"]
[]
[]
[]
[]
[]
[]
[]
[]
[]
[]
[]
[]
[]
[]
[]
[]
[]
[]
[]
[]
[]
[]
[null,{"$f":"CHOOSE(LJazyk,\"   Zadání pro 6. řádek výsledkové tabulky\",  \"   Input for row 6 of results table\")","v":"   Input for row 6 of results table"},null,null,null,null,null,{"$f":"IF(COUNT(G495,K495)>=2,CHOOSE(LJazyk,\"Zadat jen jeden čas !!\",  \"Enter only one time value !!\"),\"\")","v":""}]
[null,{"$f":"CHOOSE(LJazyk,\"  Nastavený čas, zadat jen jednou:\",  \"  Selected time, enter only once:\")","v":"  Selected time, enter only once:"},null,null,null,{"$f":"CHOOSE(LJazyk,\"buď\",  \"either\")","v":"either"},null,"s",{"$f":"CHOOSE(LJazyk,\"nebo\",  \"or\")","v":"or"},"1 /",null,"s"]
[null,null,null,null,null,null,null,null,null,{"$f":"IF(COUNT(G495,K495)>=2,\"\",IF(ISNUMBER(G495),1/G495,IF(ISNUMBER(K495),K495,\"\")))","v":""}]
[null,null,null,null,null,{"$f":"CHOOSE(LJazyk,\"Změřené hodnoty [μs]\",  \"Measured values [μs]\")","v":"Measured values [μs]"}]
[null,null,null,null,null,"Shutter"," C1","C2"," C1 1th"," C1 2nd"," C2 1th"," C2 2nd"]
[]
[]
[]
[]
[]
[]
[]
[]
[]
[]
[]
[]
[]
[]
[]
[]
[]
[]
[]
[]
[]
[]
[null,{"$f":"CHOOSE(LJazyk,\"   Zadání pro 7. řádek výsledkové tabulky\",  \"   Input for row 7 of results table\")","v":"   Input for row 7 of results table"},null,null,null,null,null,{"$f":"IF(COUNT(G522,K522)>=2,CHOOSE(LJazyk,\"Zadat jen jeden čas !!\",  \"Enter only one time value !!\"),\"\")","v":""}]
[null,{"$f":"CHOOSE(LJazyk,\"  Nastavený čas, zadat jen jednou:\",  \"  Selected time, enter only once:\")","v":"  Selected time, enter only once:"},null,null,null,{"$f":"CHOOSE(LJazyk,\"buď\",  \"either\")","v":"either"},null,"s",{"$f":"CHOOSE(LJazyk,\"nebo\",  \"or\")","v":"or"},"1 /",null,"s"]
[null,null,null,null,null,null,null,null,null,{"$f":"IF(COUNT(G522,K522)>=2,\"\",IF(ISNUMBER(G522),1/G522,IF(ISNUMBER(K522),K522,\"\")))","v":""}]
[null,null,null,null,null,{"$f":"CHOOSE(LJazyk,\"Změřené hodnoty [μs]\",  \"Measured values [μs]\")","v":"Measured values [μs]"}]
[null,null,null,null,null,"Shutter"," C1","C2"," C1 1th"," C1 2nd"," C2 1th"," C2 2nd"]
[]
[]
[]
[]
[]
[]
[]
[]
[]
[]
[]
[]
[]
[]
[]
[]
[]
[]
[]
[]
[]
[]
[null,{"$f":"CHOOSE(LJazyk,\"   Zadání pro 8. řádek výsledkové tabulky\",  \"   Input for row 8 of results table\")","v":"   Input for row 8 of results table"},null,null,null,null,null,{"$f":"IF(COUNT(G549,K549)>=2,CHOOSE(LJazyk,\"Zadat jen jeden čas !!\",  \"Enter only one time value !!\"),\"\")","v":""}]
[null,{"$f":"CHOOSE(LJazyk,\"  Nastavený čas, zadat jen jednou:\",  \"  Selected time, enter only once:\")","v":"  Selected time, enter only once:"},null,null,null,{"$f":"CHOOSE(LJazyk,\"buď\",  \"either\")","v":"either"},null,"s",{"$f":"CHOOSE(LJazyk,\"nebo\",  \"or\")","v":"or"},"1 /",null,"s"]
[null,null,null,null,null,null,null,null,null,{"$f":"IF(COUNT(G549,K549)>=2,\"\",IF(ISNUMBER(G549),1/G549,IF(ISNUMBER(K549),K549,\"\")))","v":""}]
[null,null,null,null,null,{"$f":"CHOOSE(LJazyk,\"Změřené hodnoty [μs]\",  \"Measured values [μs]\")","v":"Measured values [μs]"}]
[null,null,null,null,null,"Shutter"," C1","C2"," C1 1th"," C1 2nd"," C2 1th"," C2 2nd"]
[]
[]
[]
[]
[]
[]
[]
[]
[]
[]
[]
[]
[]
[]
[]
[]
[]
[]
[]
[]
[]
[]
[null,{"$f":"CHOOSE(LJazyk,\"   Zadání pro 9. řádek výsledkové tabulky\",  \"   Input for row 9 of results table\")","v":"   Input for row 9 of results table"},null,null,null,null,null,{"$f":"IF(COUNT(G576,K576)>=2,CHOOSE(LJazyk,\"Zadat jen jeden čas !!\",  \"Enter only one time value !!\"),\"\")","v":""}]
[null,{"$f":"CHOOSE(LJazyk,\"  Nastavený čas, zadat jen jednou:\",  \"  Selected time, enter only once:\")","v":"  Selected time, enter only once:"},null,null,null,{"$f":"CHOOSE(LJazyk,\"buď\",  \"either\")","v":"either"},null,"s",{"$f":"CHOOSE(LJazyk,\"nebo\",  \"or\")","v":"or"},"1 /",null,"s"]
[null,null,null,null,null,null,null,null,null,{"$f":"IF(COUNT(G576,K576)>=2,\"\",IF(ISNUMBER(G576),1/G576,IF(ISNUMBER(K576),K576,\"\")))","v":""}]
[null,null,null,null,null,{"$f":"CHOOSE(LJazyk,\"Změřené hodnoty [μs]\",  \"Measured values [μs]\")","v":"Measured values [μs]"}]
[null,null,null,null,null,"Shutter"," C1","C2"," C1 1th"," C1 2nd"," C2 1th"," C2 2nd"]
[]
[]
[]
[]
[]
[]
[]
[]
[]
[]
[]
[]
[]
[]
[]
[]
[]
[]
[]
[]
[]
[]
[null,{"$f":"CHOOSE(LJazyk,\"   Zadání pro 10. řádek výsledkové tabulky\",  \"   Input for row 10 of results table\")","v":"   Input for row 10 of results table"},null,null,null,null,null,{"$f":"IF(COUNT(G603,K603)>=2,CHOOSE(LJazyk,\"Zadat jen jeden čas !!\",  \"Enter only one time value !!\"),\"\")","v":""}]
[null,{"$f":"CHOOSE(LJazyk,\"  Nastavený čas, zadat jen jednou:\",  \"  Selected time, enter only once:\")","v":"  Selected time, enter only once:"},null,null,null,{"$f":"CHOOSE(LJazyk,\"buď\",  \"either\")","v":"either"},null,"s",{"$f":"CHOOSE(LJazyk,\"nebo\",  \"or\")","v":"or"},"1 /",null,"s"]
[null,null,null,null,null,null,null,null,null,{"$f":"IF(COUNT(G603,K603)>=2,\"\",IF(ISNUMBER(G603),1/G603,IF(ISNUMBER(K603),K603,\"\")))","v":""}]
[null,null,null,null,null,{"$f":"CHOOSE(LJazyk,\"Změřené hodnoty [μs]\",  \"Measured values [μs]\")","v":"Measured values [μs]"}]
[null,null,null,null,null,"Shutter"," C1","C2"," C1 1th"," C1 2nd"," C2 1th"," C2 2nd"]
[]
[]
[]
[]
[]
[]
[]
[]
[]
[]
[]
[]
[]
[]
[]
[]
[]
[]
[]
[]
[]
[]
[null,{"$f":"CHOOSE(LJazyk,\"   Zadání pro 11. řádek výsledkové tabulky\",  \"   Input for row 11 of results table\")","v":"   Input for row 11 of results table"},null,null,null,null,null,{"$f":"IF(COUNT(G630,K630)>=2,CHOOSE(LJazyk,\"Zadat jen jeden čas !!\",  \"Enter only one time value !!\"),\"\")","v":""}]
[null,{"$f":"CHOOSE(LJazyk,\"  Nastavený čas, zadat jen jednou:\",  \"  Selected time, enter only once:\")","v":"  Selected time, enter only once:"},null,null,null,{"$f":"CHOOSE(LJazyk,\"buď\",  \"either\")","v":"either"},null,"s",{"$f":"CHOOSE(LJazyk,\"nebo\",  \"or\")","v":"or"},"1 /",null,"s"]
[null,null,null,null,null,null,null,null,null,{"$f":"IF(COUNT(G630,K630)>=2,\"\",IF(ISNUMBER(G630),1/G630,IF(ISNUMBER(K630),K630,\"\")))","v":""}]
[null,null,null,null,null,{"$f":"CHOOSE(LJazyk,\"Změřené hodnoty [μs]\",  \"Measured values [μs]\")","v":"Measured values [μs]"}]
[null,null,null,null,null,"Shutter"," C1","C2"," C1 1th"," C1 2nd"," C2 1th"," C2 2nd"]
[]
[]
[]
[]
[]
[]
[]
[]
[]
[]
[]
[]
[]
[]
[]
[]
[]
[]
[]
[]
[]
[]
[null,{"$f":"CHOOSE(LJazyk,\"   Zadání pro 12. řádek výsledkové tabulky\",  \"   Input for row 12 of results table\")","v":"   Input for row 12 of results table"},null,null,null,null,null,{"$f":"IF(COUNT(G657,K657)>=2,CHOOSE(LJazyk,\"Zadat jen jeden čas !!\",  \"Enter only one time value !!\"),\"\")","v":""}]
[null,{"$f":"CHOOSE(LJazyk,\"  Nastavený čas, zadat jen jednou:\",  \"  Selected time, enter only once:\")","v":"  Selected time, enter only once:"},null,null,null,{"$f":"CHOOSE(LJazyk,\"buď\",  \"either\")","v":"either"},null,"s",{"$f":"CHOOSE(LJazyk,\"nebo\",  \"or\")","v":"or"},"1 /",null,"s"]
[null,null,null,null,null,null,null,null,null,{"$f":"IF(COUNT(G657,K657)>=2,\"\",IF(ISNUMBER(G657),1/G657,IF(ISNUMBER(K657),K657,\"\")))","v":""}]
[null,null,null,null,null,{"$f":"CHOOSE(LJazyk,\"Změřené hodnoty [μs]\",  \"Measured values [μs]\")","v":"Measured values [μs]"}]
[null,null,null,null,null,"Shutter"," C1","C2"," C1 1th"," C1 2nd"," C2 1th"," C2 2nd"]
[]
[]
[]
[]
[]
[]
[]
[]
[]
[]
[]
[]
[]
[]
[]
[]
[]
[]
[]
[]
[]
[]
[null,{"$f":"CHOOSE(LJazyk,\"   Zadání pro 13. řádek výsledkové tabulky\",  \"   Input for row 13 of results table\")","v":"   Input for row 13 of results table"},null,null,null,null,null,{"$f":"IF(COUNT(G684,K684)>=2,CHOOSE(LJazyk,\"Zadat jen jeden čas !!\",  \"Enter only one time value !!\"),\"\")","v":""}]
[null,{"$f":"CHOOSE(LJazyk,\"  Nastavený čas, zadat jen jednou:\",  \"  Selected time, enter only once:\")","v":"  Selected time, enter only once:"},null,null,null,{"$f":"CHOOSE(LJazyk,\"buď\",  \"either\")","v":"either"},null,"s",{"$f":"CHOOSE(LJazyk,\"nebo\",  \"or\")","v":"or"},"1 /",null,"s"]
[null,null,null,null,null,null,null,null,null,{"$f":"IF(COUNT(G684,K684)>=2,\"\",IF(ISNUMBER(G684),1/G684,IF(ISNUMBER(K684),K684,\"\")))","v":""}]
[null,null,null,null,null,{"$f":"CHOOSE(LJazyk,\"Změřené hodnoty [μs]\",  \"Measured values [μs]\")","v":"Measured values [μs]"}]
[null,null,null,null,null,"Shutter"," C1","C2"," C1 1th"," C1 2nd"," C2 1th"," C2 2nd"]
[]
[]
[]
[]
[]
[]
[]
[]
[]
[]
[]
[]
[]
[]
[]
[]
[]
[]
[]
[]
[]
[]
[null,{"$f":"CHOOSE(LJazyk,\"   Zadání pro 14. řádek výsledkové tabulky\",  \"   Input for row 14 of results table\")","v":"   Input for row 14 of results table"},null,null,null,null,null,{"$f":"IF(COUNT(G711,K711)>=2,CHOOSE(LJazyk,\"Zadat jen jeden čas !!\",  \"Enter only one time value !!\"),\"\")","v":""}]
[null,{"$f":"CHOOSE(LJazyk,\"  Nastavený čas, zadat jen jednou:\",  \"  Selected time, enter only once:\")","v":"  Selected time, enter only once:"},null,null,null,{"$f":"CHOOSE(LJazyk,\"buď\",  \"either\")","v":"either"},null,"s",{"$f":"CHOOSE(LJazyk,\"nebo\",  \"or\")","v":"or"},"1 /",null,"s"]
[null,null,null,null,null,null,null,null,null,{"$f":"IF(COUNT(G711,K711)>=2,\"\",IF(ISNUMBER(G711),1/G711,IF(ISNUMBER(K711),K711,\"\")))","v":""}]
[null,null,null,null,null,{"$f":"CHOOSE(LJazyk,\"Změřené hodnoty [μs]\",  \"Measured values [μs]\")","v":"Measured values [μs]"}]
[null,null,null,null,null,"Shutter"," C1","C2"," C1 1th"," C1 2nd"," C2 1th"," C2 2nd"]
[]
[]
[]
[]
[]
[]
[]
[]
[]
[]
[]
[]
[]
[]
[]
[]
[]
[]
[]
[]
[]
[]
[null,{"$f":"CHOOSE(LJazyk,\"   Zadání pro 15. řádek výsledkové tabulky\",  \"   Input for row 15 of results table\")","v":"   Input for row 15 of results table"},null,null,null,null,null,{"$f":"IF(COUNT(G738,K738)>=2,CHOOSE(LJazyk,\"Zadat jen jeden čas !!\",  \"Enter only one time value !!\"),\"\")","v":""}]
[null,{"$f":"CHOOSE(LJazyk,\"  Nastavený čas, zadat jen jednou:\",  \"  Selected time, enter only once:\")","v":"  Selected time, enter only once:"},null,null,null,{"$f":"CHOOSE(LJazyk,\"buď\",  \"either\")","v":"either"},null,"s",{"$f":"CHOOSE(LJazyk,\"nebo\",  \"or\")","v":"or"},"1 /",null,"s"]
[null,null,null,null,null,null,null,null,null,{"$f":"IF(COUNT(G738,K738)>=2,\"\",IF(ISNUMBER(G738),1/G738,IF(ISNUMBER(K738),K738,\"\")))","v":""}]
[null,null,null,null,null,{"$f":"CHOOSE(LJazyk,\"Změřené hodnoty [μs]\",  \"Measured values [μs]\")","v":"Measured values [μs]"}]
[null,null,null,null,null,"Shutter"," C1","C2"," C1 1th"," C1 2nd"," C2 1th"," C2 2nd"]